program: Orca
programVersion: 6.0.1
elementType: C C C C C C C C C C C C O C O C O C O C C C C C C C C C C N H H H H H H H H H H H H H H H H H H H H C H H H H F F F
charge: 0
multiplicity: 1
keywords: UKS wB97X-D3 def2-TZVP def2/J RIJCOSX CPCM(Toluene) IRC
formula: C26H24F3NO4
InChI: InChI=1/C26H24F3NO4/c1-5-6-13-25(23(31)33-3,24(32)34-4)21-15-18(14-17-12-11-16(2)30-22(17)21)19-9-7-8-10-20(19)26(27,28)29/h5-12,14-15,21H,1,13H2,2-4H3
58 atoms
C  1.73911 4.87586 0.399558
C  0.712979 3.798069 0.212785
C  -0.583109 4.076846 -0.206331
C  -1.474839 3.0345 -0.364824
C  -1.062709 1.729978 -0.1199
C  -1.982685 0.59186 -0.210889
C  -1.669375 0.059725 -2.37547
C  -1.066509 -1.179583 -2.290937
C  0.170482 -1.406765 -1.699036
C  1.317211 -0.439267 -1.78407
C  1.958138 -0.215941 -0.415788
C  3.047055 0.858925 -0.497941
O  3.742002 0.913587 0.634446
C  4.739449 1.932621 0.710565
O  3.280684 1.525219 -1.469607
C  2.66116 -1.484521 0.084092
O  3.555594 -1.905885 -0.807774
C  4.321981 -3.056082 -0.439012
O  2.462841 -2.032011 1.135498
C  0.802017 0.154613 0.548059
C  -0.263296 -0.916365 0.461639
C  -1.612304 -0.59501 0.412277
C  -2.623696 -1.647997 0.687143
C  -3.78913 -1.432728 1.442046
C  -4.71526 -2.454161 1.615767
C  -4.503128 -3.707903 1.069586
C  -3.336815 -3.950223 0.365911
C  -2.41468 -2.933314 0.185517
C  0.261047 1.541848 0.27783
N  1.10679 2.548858 0.455125
H  1.302938 5.868348 0.291645
H  2.533064 4.762303 -0.342223
H  2.196795 4.794976 1.386625
H  -0.885115 5.099311 -0.395551
H  -2.497899 3.226397 -0.670292
H  -3.030277 0.839423 -0.311632
H  -1.078038 0.961082 -2.463707
H  -2.673486 0.128927 -2.77698
H  -1.711065 -2.044462 -2.417453
H  0.467906 -2.448231 -1.595147
H  0.989944 0.528845 -2.162282
H  2.062291 -0.816184 -2.485988
H  5.192134 1.830884 1.692778
H  4.273297 2.912128 0.605114
H  5.485945 1.794741 -0.071059
H  3.665829 -3.908832 -0.26861
H  4.895684 -2.851789 0.464408
H  4.986199 -3.247591 -1.276797
H  1.210576 0.152666 1.562585
H  0.014633 -1.855241 0.923842
C  -4.086197 -0.124856 2.142234
H  -5.60526 -2.27118 2.202258
H  -5.236442 -4.491164 1.21455
H  -3.140736 -4.932064 -0.047958
H  -1.506634 -3.13588 -0.365174
F  -2.995634 0.464706 2.646952
F  -4.680477 0.774687 1.328622
F  -4.930981 -0.296701 3.172976
elementType: C O N H F
totalener: -1660.52146204089445 hartree
nucrepener: 3851.97442047793220 hartree
electener: -5512.48228701854259 hartree
oneelecener: -9937.30999029055238 hartree
twoeener: 4424.82770327200978 hartree
cpcmener: -0.01362478664801 hartree
kineticenergy: 1653.73082301556747 hartree
xcener: -154.550587405844 hartree
s2: 0.000000
energy: -675.3185 -675.3096 -675.2829 -524.9108 -524.6987 -523.2839 -523.0630 -392.3044 -286.5999 -283.5239 -283.3811 -281.1261 -280.9500 -280.8962 -280.8569 -280.8283 -280.6333 -280.6030 -280.3344 -280.1890 -280.1527 -280.1216 -280.1055 -280.0931 -280.0857 -280.0846 -280.0111 -280.0088 -279.9467 -279.8198 -279.7816 -279.7626 -279.4564 -279.4013 -39.0864 -36.5831 -36.5187 -33.8813 -33.5550 -31.2863 -31.0908 -29.2421 -27.4624 -26.9178 -26.0344 -25.1394 -25.0450 -24.7416 -24.5636 -23.7653 -23.4616 -23.1954 -22.7600 -22.5083 -22.1659 -21.8050 -20.5518 -20.4199 -20.2618 -20.0263 -19.7096 -19.5190 -19.0985 -18.9084 -18.8700 -18.4357 -18.0962 -17.8974 -17.3250 -17.0785 -16.9594 -16.9289 -16.5183 -16.3497 -16.2328 -16.0014 -15.9536 -15.9013 -15.8554 -15.7842 -15.7603 -15.4539 -15.2623 -15.0228 -14.9540 -14.7933 -14.6343 -14.5516 -14.3917 -14.2967 -14.1106 -14.0322 -13.9126 -13.8618 -13.7754 -13.7131 -13.6558 -13.4649 -13.2414 -13.1943 -13.0632 -12.9306 -12.8817 -12.7481 -12.6664 -12.5616 -12.3523 -12.2666 -12.1905 -12.0946 -11.8147 -11.6461 -11.2419 -11.0522 -10.7240 -10.2880 -10.1542 -9.8818 -9.7355 -9.6139 -9.5431 -8.4332 -7.8574 0.4111 0.9807 1.0868 1.3080 1.9279 1.9874 2.4985 2.8637 3.0621 3.3635 3.6283 electronvolt
chargesum: -0.0000000
charge: -0.420756 0.218608 -0.201501 -0.171932 -0.022205 -0.253438 -0.316713 -0.117600 -0.216537 -0.297271 0.378612 0.242464 -0.253511 -0.234075 -0.366707 0.233693 -0.269296 -0.230955 -0.373524 0.431534 -0.546203 0.332616 0.246899 -0.222861 -0.119328 -0.168860 -0.132856 -0.319123 -0.107959 -0.363974 0.135632 0.150136 0.144469 0.148353 0.148506 0.175507 0.168519 0.144559 0.136852 0.146549 0.160782 0.157914 0.148213 0.137782 0.145616 0.143737 0.147689 0.151563 0.135303 0.193331 0.526857 0.158005 0.148901 0.145537 0.171795 -0.168145 -0.182290 -0.178908
charge: -0.258427 -0.238507 -0.125049 -0.077660 -0.122731 -0.069664 -0.166280 -0.221676 -0.139634 -0.182635 -0.173758 -0.450418 0.268556 -0.298801 0.109174 -0.437186 0.264232 -0.295190 0.112289 -0.126419 -0.059054 -0.136173 -0.054538 -0.095054 -0.095803 -0.135773 -0.126208 -0.093569 -0.138206 0.192204 0.128403 0.134664 0.132683 0.153557 0.158251 0.157831 0.134643 0.128994 0.147702 0.147552 0.158360 0.158006 0.117435 0.114784 0.115389 0.116068 0.117655 0.118185 0.185537 0.158354 -0.623280 0.159656 0.152588 0.153194 0.160678 0.211595 0.179206 0.194268
qa: -0.4208 0.2186 -0.2015 -0.1719 -0.0222 -0.2534 -0.3167 -0.1176 -0.2165 -0.2973 0.3786 0.2425 -0.2535 -0.2341 -0.3667 0.2337 -0.2693 -0.2310 -0.3735 0.4315 -0.5462 0.3326 0.2469 -0.2229 -0.1193 -0.1689 -0.1329 -0.3191 -0.1080 -0.3640 0.1356 0.1501 0.1445 0.1484 0.1485 0.1755 0.1685 0.1446 0.1369 0.1465 0.1608 0.1579 0.1482 0.1378 0.1456 0.1437 0.1477 0.1516 0.1353 0.1933 0.5269 0.1580 0.1489 0.1455 0.1718 -0.1681 -0.1823 -0.1789
va: 3.8707 3.8203 3.9197 4.0111 3.8529 3.7742 3.9321 3.8889 3.8549 4.0340 3.5876 4.3259 2.1186 3.8790 2.1380 4.2454 2.1347 3.8643 2.1294 3.7003 4.1697 3.2152 3.3548 3.9272 3.8252 3.8907 3.9183 3.9417 4.0920 3.0329 0.9700 0.9646 0.9694 0.9696 0.9738 0.9713 0.9583 0.9741 0.9670 0.9632 0.9779 0.9795 0.9672 0.9645 0.9684 0.9667 0.9668 0.9661 0.9870 0.9607 4.4217 0.9723 0.9665 0.9689 0.9629 1.1290 1.1024 1.1221
dispersion: -0.039083488 hartree
energy: -1660.560545528961 hartree
dipole: 29.982913755 -29.820491867 0.162421888 0.135854280 -0.909463715 -0.773609435 -18.911201893 18.289425982 -0.621775911
dipolemethod: SCF
magnitude: 1.005712539 au
magnitude: 2.556318121 debye
temp: 298.15 k
press: 1.00 atm
zeropoint: 0.45643735 hartree
thermalvibcorrection: 0.02712821 hartree
thermalrotcorrection: 0.00141627 hartree
thermaltrasncorrection: 0.00141627 hartree
thermaltotal: -1660.07414743 hartree
thermalcorr: 0.02996075 hartree
nonthermalcorr: 0.45643735 hartree
totalcorr: 0.48639810 hartree
thermalcorrenthalpy: 0.00094421 hartree
totalenthalpy: -1660.07320322 hartree
vibrat: 0.04812362 hartree
rotat: 0.01740312 hartree
transl: 0.02106745 hartree
total: 0.08659418 hartree
totalentropycorr: -0.08659418 hartree
gibbsenthalpy: -1660.15979740 hartree
gibbsminuselec: 0.40074813 hartree
