program: Orca
programVersion: 6.0.1
charge: 0
multiplicity: 3
keywords: UKS wB97X-D3 def2-TZVP def2/J RIJCOSX CPCM(Toluene) NEB-TS TightSCF Freq
frequency: 0.00 0.00 0.00 0.00 0.00 0.00 -480.56 21.78 38.14 46.72 54.53 59.42 63.98 83.35 87.18 93.57 104.79 120.11 147.50 159.50 162.52 164.35 171.02 185.17 201.03 216.79 222.75 244.61 273.83 289.21 307.07 314.19 324.31 349.73 358.89 386.24 412.24 416.45 423.42 431.11 443.58 477.65 505.25 517.40 550.28 559.74 566.63 603.74 625.76 627.57 644.89 657.57 684.49 689.25 698.19 727.37 747.25 762.22 775.06 782.13 803.83 818.31 833.79 844.26 858.43 863.66 873.38 898.49 908.63 920.54 939.74 957.64 975.34 982.56 989.85 996.81 1003.57 1004.99 1010.20 1014.24 1024.24 1037.64 1049.96 1063.72 1069.89 1076.41 1109.05 1113.44 1128.13 1150.56 1156.81 1165.91 1177.17 1180.38 1191.41 1197.50 1215.59 1219.65 1228.24 1233.51 1240.62 1253.14 1261.39 1267.14 1272.65 1275.56 1291.30 1298.54 1301.82 1319.26 1336.26 1337.92 1344.57 1345.56 1356.98 1369.28 1409.23 1436.29 1453.15 1463.55 1472.75 1475.89 1477.98 1479.68 1483.04 1484.05 1486.11 1490.00 1491.31 1492.06 1495.35 1517.97 1526.96 1593.78 1598.96 1619.36 1653.11 1678.80 1806.95 1827.09 3066.36 3067.07 3074.82 3079.87 3080.19 3101.91 3119.38 3136.45 3136.58 3146.63 3160.49 3160.79 3162.36 3163.38 3188.98 3191.85 3193.12 3195.94 3196.22 3199.01 3216.96 3218.43 3223.65 3227.11 3256.00
frequency: 21.78 38.14 46.72 54.53 59.42 63.98 83.35 87.18 93.57 104.79 120.11 147.50 159.50 162.52 164.35 171.02 185.17 201.03 216.79 222.75 244.61 273.83 289.21 307.07 314.19 324.31 349.73 358.89 386.24 412.24 416.45 423.42 431.11 443.58 477.65 505.25 517.40 550.28 559.74 566.63 603.74 625.76 627.57 644.89 657.57 684.49 689.25 698.19 727.37 747.25 762.22 775.06 782.13 803.83 818.31 833.79 844.26 858.43 863.66 873.38 898.49 908.63 920.54 939.74 957.64 975.34 982.56 989.85 996.81 1003.57 1004.99 1010.20 1014.24 1024.24 1037.64 1049.96 1063.72 1069.89 1076.41 1109.05 1113.44 1128.13 1150.56 1156.81 1165.91 1177.17 1180.38 1191.41 1197.50 1215.59 1219.65 1228.24 1233.51 1240.62 1253.14 1261.39 1267.14 1272.65 1275.56 1291.30 1298.54 1301.82 1319.26 1336.26 1337.92 1344.57 1345.56 1356.98 1369.28 1409.23 1436.29 1453.15 1463.55 1472.75 1475.89 1477.98 1479.68 1483.04 1484.05 1486.11 1490.00 1491.31 1492.06 1495.35 1517.97 1526.96 1593.78 1598.96 1619.36 1653.11 1678.80 1806.95 1827.09 3066.36 3067.07 3074.82 3079.87 3080.19 3101.91 3119.38 3136.45 3136.58 3146.63 3160.49 3160.79 3162.36 3163.38 3188.98 3191.85 3193.12 3195.94 3196.22 3199.01 3216.96 3218.43 3223.65 3227.11 3256.00
formula: C25H25NO4
InChI: InChI=1/C25H25NO4/c1-16-12-13-19-18-11-7-8-14-25(23(27)29-2,24(28)30-3)21(22(19)26-16)15-20(18)17-9-5-4-6-10-17/h4-10,12-13,15,18,21H,11,14H2,1-3H3
55 atoms
C  1.133789 4.638858 1.30068
C  0.255735 3.563424 0.732394
C  -0.944685 3.853458 0.093229
C  -1.696734 2.812455 -0.41256
C  -1.246876 1.503386 -0.296678
C  -2.085876 0.354896 -0.82144
C  -1.839166 0.035883 -2.335329
C  -1.076467 -1.248156 -2.4767
C  0.196991 -1.407078 -2.032507
C  1.222592 -0.314126 -1.89878
C  1.795634 -0.238858 -0.479597
C  2.796711 0.913576 -0.365086
O  3.486638 0.830647 0.768272
C  4.387652 1.905343 1.038093
O  2.958162 1.767002 -1.19535
C  2.566418 -1.51461 -0.123176
O  3.512885 -1.757658 -1.028406
C  4.33987 -2.899295 -0.785945
O  2.374555 -2.207678 0.839682
C  0.587755 -0.06855 0.495343
C  -0.386892 -1.166656 0.196588
C  -1.825067 -0.850429 0.046946
C  -2.836908 -1.554275 0.728571
C  -4.221975 -1.326077 0.48833
C  -5.194084 -2.036809 1.155074
C  -4.851265 -3.004843 2.098989
C  -3.504602 -3.25145 2.35672
C  -2.519771 -2.556116 1.689551
C  -0.026515 1.308314 0.346056
N  0.686866 2.311467 0.854127
H  0.639428 5.60965 1.287094
H  2.053777 4.711282 0.716075
H  1.41271 4.395549 2.326622
H  -1.285349 4.877889 0.00924
H  -2.647073 3.010775 -0.897681
H  -3.121551 0.672978 -0.721191
H  -1.326988 0.877346 -2.809572
H  -2.805956 -0.061953 -2.829362
H  -1.648394 -2.137496 -2.71815
H  0.601126 -2.416534 -2.04338
H  0.795649 0.659605 -2.137984
H  2.030164 -0.4862 -2.611488
H  4.853953 1.668236 1.990062
H  3.833117 2.840854 1.107628
H  5.138112 1.981863 0.252004
H  3.736917 -3.806643 -0.772327
H  4.858976 -2.793366 0.166002
H  5.049788 -2.927024 -1.607513
H  0.975473 -0.152449 1.51498
H  -0.095156 -2.16519 0.482072
H  -4.528145 -0.592423 -0.245705
H  -6.238056 -1.838433 0.941124
H  -5.621763 -3.558328 2.621199
H  -3.223766 -3.999497 3.089179
H  -1.482366 -2.766536 1.913982
totalener: -1323.36588535267424 hartree
nucrepener: 3050.76681118556417 hartree
electener: -4374.11934407974331 hartree
oneelecener: -7868.77543453571343 hartree
twoeener: 3494.65609045596966 hartree
cpcmener: -0.01338860306047 hartree
kineticenergy: 1317.55168414313334 hartree
xcener: -128.495606144383 hartree
s2: 2.090943
dispersion: -0.034087695 hartree
s2: 2.089903
dispersion: -0.034127625 hartree
s2: 2.089467
dispersion: -0.034133953 hartree
s2: 2.088601
dispersion: -0.034191889 hartree
s2: 2.087331
dispersion: -0.034178738 hartree
s2: 2.085222
dispersion: -0.034306986 hartree
s2: 2.083981
dispersion: -0.034100840 hartree
s2: 2.083093
dispersion: -0.034287991 hartree
s2: 2.083672
dispersion: -0.034300282 hartree
s2: 2.084243
dispersion: -0.034270645 hartree
s2: 2.084284
dispersion: -0.034275301 hartree
s2: 2.084608
dispersion: -0.034252924 hartree
s2: 2.084517
dispersion: -0.034254931 hartree
s2: 2.084110
dispersion: -0.034269198 hartree
s2: 2.084272
dispersion: -0.034270110 hartree
s2: 2.085056
dispersion: -0.034228735 hartree
s2: 2.084438
dispersion: -0.034258647 hartree
s2: 2.084267
dispersion: -0.034266785 hartree
s2: 2.084184
dispersion: -0.034273717 hartree
s2: 2.085566
dispersion: -0.034201753 hartree
s2: 2.084352
dispersion: -0.034263233 hartree
s2: 2.083895
dispersion: -0.034263756 hartree
s2: 2.084240
dispersion: -0.034287855 hartree
s2: 2.084030
dispersion: -0.034210547 hartree
s2: 2.084280
dispersion: -0.034264440 hartree
s2: 2.084277
dispersion: -0.034267536 hartree
elementType: C O N H
s2: 2.084299
energy: -524.8766 -524.7226 -523.2437 -523.0931 -392.2746 -283.4860 -283.3774 -281.0979 -280.9609 -280.9099 -280.8389 -280.8292 -280.2570 -280.2324 -280.1509 -280.1182 -280.0580 -280.0010 -279.9752 -279.9455 -279.8297 -279.7744 -279.7298 -279.7145 -279.6608 -279.6532 -279.6374 -279.6155 -279.6055 -279.4051 -33.8546 -33.5637 -31.2472 -31.1099 -29.2058 -27.1976 -26.6155 -26.0375 -25.1050 -25.0107 -24.5126 -23.8348 -23.5133 -23.4610 -23.1492 -22.6395 -22.1902 -21.9786 -20.6105 -20.4161 -20.0512 -19.7243 -19.1356 -19.0176 -18.8853 -18.2374 -17.9539 -17.4384 -17.2398 -16.9773 -16.8754 -16.4748 -16.3611 -16.3054 -16.0364 -15.9355 -15.8272 -15.7449 -15.3032 -15.1071 -14.9245 -14.6895 -14.6697 -14.6195 -14.4929 -14.2190 -14.0804 -13.9080 -13.8089 -13.7179 -13.6404 -13.4067 -13.2218 -13.1848 -12.9749 -12.9210 -12.8738 -12.7291 -12.6632 -12.3883 -12.2621 -12.1349 -12.0507 -11.8683 -11.6914 -11.2769 -11.1641 -11.0613 -10.8202 -10.6170 -10.1647 -10.1105 -9.9652 -9.5736 -9.5564 -9.0175 -7.7412 -5.9232 1.0309 1.6515 1.7490 1.9498 2.0612 2.6387 3.0026 3.1273 3.3764 3.4511 3.8860 electronvolt
energy: -524.8765 -524.7227 -523.2437 -523.0904 -392.2762 -283.4865 -283.3776 -281.0979 -280.9609 -280.8987 -280.8371 -280.8268 -280.2627 -280.1520 -280.1156 -280.0590 -280.0486 -280.0424 -279.9871 -279.8223 -279.7749 -279.7611 -279.7277 -279.6845 -279.6613 -279.6429 -279.5853 -279.5675 -279.4840 -279.4052 -33.8540 -33.5629 -31.2466 -31.1057 -29.1962 -26.9576 -26.5230 -25.9408 -25.0072 -24.8977 -24.2967 -23.7083 -23.4211 -23.3814 -23.1281 -22.4774 -22.0600 -21.7798 -20.5192 -20.1414 -19.9526 -19.6780 -19.0747 -18.8774 -18.8564 -18.1734 -17.9133 -17.2932 -17.1467 -16.8836 -16.7435 -16.4537 -16.2825 -16.2110 -15.9844 -15.9149 -15.8063 -15.7044 -15.1696 -15.0311 -14.8735 -14.6231 -14.6099 -14.5092 -14.2664 -14.1814 -14.0133 -13.8772 -13.7757 -13.6587 -13.5632 -13.3127 -13.1119 -13.0026 -12.9470 -12.8451 -12.7180 -12.6785 -12.6037 -12.3178 -12.1567 -12.0664 -11.9741 -11.8128 -11.5892 -11.2501 -11.0721 -10.9463 -10.7030 -10.1934 -10.1254 -9.6759 -9.5571 -9.2422 -9.1929 -8.9352 -0.9284 0.7956 1.1320 1.7373 1.9428 2.0450 2.4903 2.8555 3.0612 3.3883 3.4545 electronvolt
dispersion: -0.034266486 hartree
energy: -1323.403264672800 hartree
dipole: 0.323485621 -0.328198166 -0.004712545 2.576922524 -2.282461364 0.294461160 -1.497969407 1.137615266 -0.360354141
dipolemethod: SCF
magnitude: 0.465386602 au
magnitude: 1.182918735 debye
temp: 298.15 k
press: 1.00 atm
zeropoint: 0.45020687 hartree
thermalvibcorrection: 0.02361142 hartree
thermalrotcorrection: 0.00141627 hartree
thermaltrasncorrection: 0.00141627 hartree
thermaltotal: -1322.92661384 hartree
thermalcorr: 0.02644396 hartree
nonthermalcorr: 0.45020687 hartree
totalcorr: 0.47665084 hartree
thermalcorrenthalpy: 0.00094421 hartree
totalenthalpy: -1322.92566963 hartree
vibrat: 0.04174021 hartree
rotat: 0.01705345 hartree
transl: 0.02084687 hartree
total: 0.08067781 hartree
totalentropycorr: -0.08067781 hartree
gibbsenthalpy: -1323.00634744 hartree
gibbsminuselec: 0.39691723 hartree
