program: Orca
programVersion: 6.0.1
elementType: C C C C C C C C C C C C O C O C O C O C C C C C C C C C C N H H H H H H H H H H H H H H H H H H H H H H H H H
charge: 0
multiplicity: 1
keywords: UKS wB97X-D3 def2-TZVP def2/J RIJCOSX CPCM(Toluene) IRC
formula: C25H25NO4
InChI: InChI=1/C25H25NO4/c1-16-12-13-19-18-11-7-8-14-25(23(27)29-2,24(28)30-3)21(22(19)26-16)15-20(18)17-9-5-4-6-10-17/h4-10,12-13,15,18,21H,11,14H2,1-3H3
55 atoms
C  1.132913 4.638431 1.301242
C  0.2554 3.563041 0.732032
C  -0.945232 3.852971 0.093227
C  -1.697004 2.811951 -0.412966
C  -1.246872 1.502951 -0.297442
C  -2.085711 0.354403 -0.822372
C  -1.838854 0.035725 -2.33634
C  -1.075754 -1.247978 -2.478171
C  0.19765 -1.406737 -2.033791
C  1.223136 -0.313753 -1.899304
C  1.795746 -0.238961 -0.479878
C  2.796806 0.913408 -0.36481
O  3.485714 0.830747 0.76918
C  4.386832 1.905265 1.039372
O  2.959166 1.766478 -1.19526
C  2.566561 -1.51476 -0.123579
O  3.512664 -1.758019 -1.029127
C  4.339611 -2.899715 -0.786806
O  2.374872 -2.207801 0.839332
C  0.587718 -0.068864 0.494912
C  -0.386755 -1.167107 0.196062
C  -1.824897 -0.850847 0.046199
C  -2.836666 -1.55407 0.728615
C  -4.221754 -1.325725 0.488802
C  -5.193743 -2.035702 1.156554
C  -4.850708 -3.003566 2.100555
C  -3.503982 -3.250358 2.357799
C  -2.519298 -2.555447 1.689959
C  -0.026646 1.30793 0.34557
N  0.686608 2.311105 0.853747
H  0.639828 5.609818 1.284166
H  2.054984 4.708502 0.719689
H  1.407989 4.396787 2.32864
H  -1.286213 4.877331 0.009707
H  -2.64778 3.010125 -0.89729
H  -3.121415 0.672443 -0.72222
H  -1.326956 0.87748 -2.810364
H  -2.805613 -0.062284 -2.830397
H  -1.647361 -2.137387 -2.720123
H  0.601881 -2.416159 -2.044522
H  0.796194 0.660033 -2.138289
H  2.030938 -0.485501 -2.611823
H  4.852493 1.668179 1.991658
H  3.832485 2.840925 1.108428
H  5.13779 1.981489 0.25373
H  3.736603 -3.807029 -0.773177
H  4.85881 -2.793871 0.165099
H  5.049445 -2.927446 -1.608448
H  0.975341 -0.152684 1.514596
H  -0.095236 -2.165511 0.482242
H  -4.528089 -0.591852 -0.244957
H  -6.237751 -1.837735 0.942415
H  -5.621102 -3.556386 2.623636
H  -3.222984 -3.998026 3.090586
H  -1.481799 -2.766241 1.913703
elementType: C O N H
totalener: -1323.39976311942337 hartree
nucrepener: 3051.72034207050137 hartree
electener: -4375.10619816056897 hartree
oneelecener: -7870.63722704485826 hartree
twoeener: 3495.53102888428930 hartree
cpcmener: -0.01394447332698 hartree
kineticenergy: 1317.46768835509602 hartree
xcener: -128.479931775151 hartree
s2: 0.000000
energy: -524.8968 -524.7294 -523.2764 -523.0868 -392.2816 -283.5113 -283.3766 -281.1113 -280.9658 -280.8999 -280.8369 -280.7960 -280.4050 -280.1839 -280.1617 -280.0952 -280.0793 -280.0655 -279.8837 -279.8623 -279.8337 -279.8000 -279.7605 -279.6528 -279.6357 -279.6332 -279.6246 -279.5838 -279.5803 -279.3925 -33.8738 -33.5719 -31.2770 -31.1086 -29.1953 -27.0663 -26.5559 -25.9858 -25.0511 -24.9494 -24.3837 -23.7957 -23.4484 -23.4230 -23.1459 -22.5756 -22.1114 -21.8841 -20.5692 -20.3036 -19.9867 -19.6939 -19.0968 -18.9182 -18.8878 -18.2173 -17.9593 -17.3607 -17.1956 -16.9583 -16.8480 -16.4767 -16.3158 -16.2654 -16.0138 -15.9480 -15.8324 -15.7394 -15.2283 -15.0587 -14.9051 -14.6427 -14.6349 -14.5468 -14.4109 -14.1984 -14.0281 -13.9078 -13.8030 -13.6915 -13.6118 -13.3735 -13.1544 -13.0974 -12.9676 -12.8670 -12.8100 -12.7295 -12.6499 -12.3634 -12.2431 -12.1014 -12.0065 -11.8505 -11.6434 -11.2757 -11.0874 -11.0014 -10.7466 -10.3747 -10.1406 -10.0192 -9.6074 -9.5502 -9.3243 -8.9789 -6.7262 -0.1850 1.0586 1.6862 1.8267 1.9977 2.2727 2.7127 3.0414 3.3647 3.4491 3.5505 electronvolt
chargesum: -0.0000000
charge: -0.417657 0.207246 -0.194761 -0.189142 -0.100768 -0.026282 -0.205496 -0.165293 -0.156350 -0.286308 0.329333 0.232085 -0.252458 -0.231927 -0.367690 0.235043 -0.269688 -0.232110 -0.372949 0.431443 -0.435756 0.190277 0.100570 -0.246619 -0.150964 -0.156903 -0.147888 -0.248608 -0.080295 -0.360913 0.134120 0.146640 0.143717 0.147968 0.147426 0.104537 0.149879 0.120580 0.137605 0.138911 0.158810 0.157838 0.148514 0.136136 0.145868 0.144794 0.147496 0.151117 0.139435 0.172509 0.132954 0.137066 0.141006 0.138340 0.147562
charge: -0.258195 -0.242094 -0.125597 -0.084831 -0.090511 -0.150232 -0.201895 -0.149576 -0.159059 -0.177476 -0.174421 -0.449429 0.269407 -0.297828 0.109052 -0.440156 0.263885 -0.295593 0.112316 -0.139349 -0.028534 -0.078654 -0.130759 -0.111882 -0.154413 -0.153991 -0.152509 -0.098475 -0.144739 0.186023 0.128091 0.133323 0.132778 0.153122 0.157086 0.165103 0.152144 0.144216 0.143902 0.149937 0.158524 0.157990 0.117634 0.114597 0.115535 0.116298 0.117514 0.118082 0.186659 0.144657 0.147651 0.148548 0.145675 0.149154 0.151294
qa: -0.4177 0.2072 -0.1948 -0.1891 -0.1008 -0.0263 -0.2055 -0.1653 -0.1564 -0.2863 0.3293 0.2321 -0.2525 -0.2319 -0.3677 0.2350 -0.2697 -0.2321 -0.3729 0.4314 -0.4358 0.1903 0.1006 -0.2466 -0.1510 -0.1569 -0.1479 -0.2486 -0.0803 -0.3609 0.1341 0.1466 0.1437 0.1480 0.1474 0.1045 0.1499 0.1206 0.1376 0.1389 0.1588 0.1578 0.1485 0.1361 0.1459 0.1448 0.1475 0.1511 0.1394 0.1725 0.1330 0.1371 0.1410 0.1383 0.1476
va: 3.8704 3.8332 3.9164 4.0143 4.0575 3.8720 3.9147 3.9389 3.8083 4.0631 3.6450 4.3359 2.1207 3.8794 2.1368 4.2252 2.1324 3.8644 2.1289 3.5873 3.9756 3.1359 3.7224 3.9303 3.9427 3.8852 3.9207 3.9757 4.0815 3.0292 0.9701 0.9636 0.9716 0.9695 0.9686 0.9725 0.9690 0.9727 0.9686 0.9698 0.9736 0.9807 0.9672 0.9648 0.9682 0.9663 0.9668 0.9663 0.9922 0.9756 0.9769 0.9696 0.9668 0.9696 0.9749
dispersion: -0.034266486 hartree
energy: -1323.434029605066 hartree
dipole: 0.323485621 -0.253333914 0.070151707 2.576922524 -2.328224906 0.248697618 -1.497969407 1.066118300 -0.431851107
dipolemethod: SCF
magnitude: 0.503256541 au
magnitude: 1.279176469 debye
temp: 298.15 k
press: 1.00 atm
zeropoint: 0.45229776 hartree
thermalvibcorrection: 0.02299656 hartree
thermalrotcorrection: 0.00141627 hartree
thermaltrasncorrection: 0.00141627 hartree
thermaltotal: -1322.95590274 hartree
thermalcorr: 0.02582910 hartree
nonthermalcorr: 0.45229776 hartree
totalcorr: 0.47812687 hartree
thermalcorrenthalpy: 0.00094421 hartree
totalenthalpy: -1322.95495853 hartree
vibrat: 0.04022937 hartree
rotat: 0.01705345 hartree
transl: 0.02084687 hartree
total: 0.07812969 hartree
totalentropycorr: -0.07812969 hartree
gibbsenthalpy: -1323.03308822 hartree
gibbsminuselec: 0.40094139 hartree
