program: Orca
programVersion: 6.0.1
charge: 0
multiplicity: 3
keywords: UKS wB97X-D3 def2-TZVP def2/J RIJCOSX CPCM(Toluene) NEB-TS TightSCF Freq
frequency: 0.00 0.00 0.00 0.00 0.00 0.00 -697.35 23.94 35.02 39.68 47.89 52.54 73.39 82.81 88.49 96.32 97.27 113.25 127.69 154.77 157.35 161.86 166.08 175.09 192.39 214.28 225.60 238.38 264.64 284.88 296.74 306.36 317.18 324.08 349.44 357.35 413.31 415.85 432.28 434.33 441.53 477.44 509.68 513.00 525.87 536.23 587.21 605.82 620.76 625.93 633.64 647.21 677.73 691.54 708.27 742.70 775.64 777.76 789.40 797.20 809.24 827.81 831.83 837.87 842.30 846.30 863.38 871.63 889.03 912.69 926.01 943.48 974.42 987.56 994.64 997.03 1000.33 1006.31 1007.01 1009.49 1028.21 1036.67 1052.10 1056.79 1061.69 1065.07 1084.00 1112.57 1121.72 1148.73 1165.15 1166.95 1168.01 1177.09 1180.98 1195.41 1203.69 1213.33 1217.95 1220.67 1226.70 1234.40 1257.81 1262.73 1267.26 1274.87 1290.66 1296.64 1301.99 1310.42 1321.86 1323.42 1337.61 1342.80 1350.74 1354.47 1376.67 1408.77 1430.06 1453.96 1471.12 1471.52 1475.79 1479.30 1482.19 1483.11 1484.03 1490.32 1491.43 1492.16 1500.04 1502.02 1522.66 1543.78 1604.14 1624.56 1629.18 1648.44 1803.70 1826.57 3063.79 3079.15 3079.92 3100.03 3105.33 3122.37 3132.61 3154.62 3159.20 3159.56 3161.29 3161.64 3162.84 3164.76 3194.38 3194.55 3194.74 3195.87 3200.78 3211.62 3217.40 3218.29 3223.98 3227.90 3250.87
frequency: 23.94 35.02 39.68 47.89 52.54 73.39 82.81 88.49 96.32 97.27 113.25 127.69 154.77 157.35 161.86 166.08 175.09 192.39 214.28 225.60 238.38 264.64 284.88 296.74 306.36 317.18 324.08 349.44 357.35 413.31 415.85 432.28 434.33 441.53 477.44 509.68 513.00 525.87 536.23 587.21 605.82 620.76 625.93 633.64 647.21 677.73 691.54 708.27 742.70 775.64 777.76 789.40 797.20 809.24 827.81 831.83 837.87 842.30 846.30 863.38 871.63 889.03 912.69 926.01 943.48 974.42 987.56 994.64 997.03 1000.33 1006.31 1007.01 1009.49 1028.21 1036.67 1052.10 1056.79 1061.69 1065.07 1084.00 1112.57 1121.72 1148.73 1165.15 1166.95 1168.01 1177.09 1180.98 1195.41 1203.69 1213.33 1217.95 1220.67 1226.70 1234.40 1257.81 1262.73 1267.26 1274.87 1290.66 1296.64 1301.99 1310.42 1321.86 1323.42 1337.61 1342.80 1350.74 1354.47 1376.67 1408.77 1430.06 1453.96 1471.12 1471.52 1475.79 1479.30 1482.19 1483.11 1484.03 1490.32 1491.43 1492.16 1500.04 1502.02 1522.66 1543.78 1604.14 1624.56 1629.18 1648.44 1803.70 1826.57 3063.79 3079.15 3079.92 3100.03 3105.33 3122.37 3132.61 3154.62 3159.20 3159.56 3161.29 3161.64 3162.84 3164.76 3194.38 3194.55 3194.74 3195.87 3200.78 3211.62 3217.40 3218.29 3223.98 3227.90 3250.87
formula: C25H25NO4
InChI: InChI=1/C25H25NO4/c1-5-16-14-25(23(27)29-3,24(28)30-4)21-20(16)19(17-9-7-6-8-10-17)13-18-12-11-15(2)26-22(18)21/h5-13,16,20-21H,1,14H2,2-4H3
55 atoms
C  1.194509 4.602255 1.219836
C  0.259719 3.55432 0.694969
C  -0.975188 3.8776 0.138815
C  -1.789118 2.86489 -0.321208
C  -1.367638 1.536412 -0.230941
C  -2.18652 0.422866 -0.66655
H  -1.26825 -3.127534 1.356998
C  -1.30769 -0.253062 -2.498203
C  -0.172199 -1.002161 -1.8123
C  1.193425 -0.300158 -1.949896
C  1.777103 -0.219617 -0.530023
C  2.779456 0.923942 -0.37562
O  3.432928 0.816676 0.77831
C  4.352035 1.864901 1.083871
O  2.985712 1.780193 -1.192671
C  2.535915 -1.499782 -0.162094
O  3.55871 -1.690579 -0.993324
C  4.385393 -2.826932 -0.728157
O  2.272372 -2.241373 0.746885
C  0.512254 -0.087663 0.356657
C  -0.424105 -1.142522 -0.280649
C  -1.85341 -0.852868 -0.001721
C  -2.706157 -1.58156 0.848829
C  -4.041548 -1.162746 1.092563
C  -4.880921 -1.885807 1.912699
C  -4.440275 -3.055523 2.527821
C  -3.13234 -3.486153 2.311389
C  -2.280691 -2.771988 1.497686
C  -0.083821 1.30908 0.302161
N  0.677993 2.28997 0.764353
H  0.730358 5.5879 1.225138
H  2.091709 4.644585 0.597707
H  1.508951 4.352841 2.234434
H  -1.29073 4.911984 0.082379
H  -2.764466 3.088058 -0.740115
H  -3.203131 0.65062 -0.958428
H  -3.036245 -0.412122 -3.751484
H  -2.429469 -2.001735 -3.020007
C  -2.298515 -0.933683 -3.154371
H  -0.128485 -2.002718 -2.243955
H  1.071947 0.720089 -2.315188
H  1.865474 -0.806329 -2.640065
H  4.792096 1.60161 2.041545
H  3.818909 2.812546 1.157389
H  5.12101 1.93651 0.315298
H  3.798438 -3.743357 -0.777546
H  4.839783 -2.739322 0.258359
H  5.148832 -2.821226 -1.50073
H  0.745281 -0.331199 1.393724
H  -0.108581 -2.123424 0.062519
H  -4.408574 -0.257259 0.626337
H  -5.894383 -1.538447 2.077401
H  -5.104283 -3.623563 3.167521
H  -2.775569 -4.391369 2.788948
H  -1.09801 0.763934 -2.817294
totalener: -1323.37662013855970 hartree
nucrepener: 3044.27393390244333 hartree
electener: -4367.63695823525813 hartree
oneelecener: -7855.70612671508570 hartree
twoeener: 3488.06916847982711 hartree
cpcmener: -0.01363897222166 hartree
kineticenergy: 1317.59563394759607 hartree
xcener: -128.503546858845 hartree
s2: 2.110597
dispersion: -0.033339934 hartree
s2: 2.111516
dispersion: -0.033401547 hartree
s2: 2.110744
dispersion: -0.033440754 hartree
s2: 2.111492
dispersion: -0.033441258 hartree
s2: 2.111463
dispersion: -0.033461345 hartree
s2: 2.111714
dispersion: -0.033402886 hartree
s2: 2.111658
dispersion: -0.033443081 hartree
s2: 2.111643
dispersion: -0.033485638 hartree
s2: 2.111774
dispersion: -0.033478311 hartree
s2: 2.111771
dispersion: -0.033513275 hartree
s2: 2.111902
dispersion: -0.033522523 hartree
s2: 2.111915
dispersion: -0.033478031 hartree
s2: 2.111803
dispersion: -0.033448881 hartree
s2: 2.111715
dispersion: -0.033430457 hartree
s2: 2.111769
dispersion: -0.033449675 hartree
s2: 2.111777
dispersion: -0.033457536 hartree
s2: 2.111848
dispersion: -0.033487518 hartree
s2: 2.111811
dispersion: -0.033465220 hartree
s2: 2.111798
dispersion: -0.033450294 hartree
s2: 2.111768
dispersion: -0.033454145 hartree
s2: 2.111890
dispersion: -0.033490715 hartree
s2: 2.111802
dispersion: -0.033461322 hartree
elementType: C H O N
s2: 2.111790
energy: -524.8481 -524.6723 -523.2340 -523.0447 -392.2962 -283.4708 -283.3573 -281.0867 -280.9393 -280.9230 -280.8579 -280.7988 -280.2672 -280.2187 -280.1576 -280.1567 -280.1038 -280.0517 -280.0346 -279.9292 -279.8792 -279.7879 -279.7148 -279.7082 -279.7011 -279.6717 -279.6521 -279.6388 -279.4421 -279.4121 -33.8347 -33.5175 -31.2277 -31.0663 -29.2460 -27.5027 -26.6895 -25.9831 -25.0840 -24.9640 -24.4557 -23.8399 -23.5453 -23.2672 -23.1443 -22.6668 -22.4918 -21.7646 -20.5431 -20.3939 -19.7100 -19.6653 -19.2899 -19.0533 -18.8049 -18.2251 -18.0234 -17.6221 -17.4791 -17.1716 -17.0022 -16.4411 -16.4314 -16.2051 -15.9887 -15.8731 -15.7697 -15.5559 -15.2253 -15.0666 -14.9647 -14.7695 -14.6681 -14.5284 -14.3971 -14.2804 -14.1395 -14.0040 -13.7489 -13.7293 -13.5793 -13.4473 -13.2300 -13.1061 -12.9315 -12.9181 -12.8556 -12.7495 -12.5349 -12.4012 -12.1669 -12.1212 -11.9265 -11.7744 -11.5778 -11.2951 -11.2377 -11.0280 -10.9088 -10.6479 -10.3395 -10.1604 -10.0547 -9.5838 -9.5509 -9.2985 -7.4730 -6.2472 1.0002 1.4677 1.7347 2.0529 2.2069 2.7381 3.0610 3.2347 3.4734 3.5016 3.8411 electronvolt
energy: -524.8479 -524.6720 -523.2339 -523.0447 -392.3240 -283.4709 -283.3566 -281.0867 -280.9393 -280.8848 -280.8184 -280.7961 -280.2036 -280.1340 -280.1166 -280.1029 -280.0970 -280.0939 -279.9708 -279.9117 -279.8958 -279.8085 -279.7092 -279.6978 -279.6834 -279.6421 -279.6302 -279.5904 -279.4145 -279.2975 -33.8341 -33.5168 -31.2273 -31.0658 -29.2140 -27.3436 -26.5859 -25.7884 -25.0022 -24.8885 -24.2752 -23.7297 -23.4530 -23.1569 -23.0860 -22.5483 -22.3393 -21.5658 -20.4726 -20.0864 -19.6180 -19.5496 -19.1969 -18.9433 -18.7796 -18.0934 -18.0019 -17.5799 -17.3940 -17.0719 -16.9566 -16.4107 -16.3528 -16.1670 -15.9285 -15.8501 -15.7594 -15.4364 -15.1764 -14.9914 -14.8192 -14.6955 -14.5870 -14.4545 -14.3394 -14.1413 -14.0435 -13.8504 -13.7215 -13.6856 -13.4999 -13.2872 -13.0872 -12.9653 -12.9012 -12.8546 -12.7511 -12.5775 -12.4941 -12.3248 -12.1086 -12.0548 -11.8366 -11.6897 -11.5404 -11.2686 -11.0783 -11.0228 -10.6622 -10.5100 -10.1140 -9.9086 -9.5899 -9.4964 -9.2457 -8.6991 -0.9236 0.2202 1.1944 1.8588 1.9720 2.0819 2.5988 2.9741 3.1473 3.4650 3.5451 electronvolt
dispersion: -0.033457807 hartree
energy: -1323.410989901413 hartree
dipole: 0.455417104 -0.449091317 0.006325787 1.856455552 -1.570741287 0.285714265 -2.117957452 1.941392928 -0.176564524
dipolemethod: SCF
magnitude: 0.335928099 au
magnitude: 0.853861370 debye
temp: 298.15 k
press: 1.00 atm
zeropoint: 0.44899857 hartree
thermalvibcorrection: 0.02391493 hartree
thermalrotcorrection: 0.00141627 hartree
thermaltrasncorrection: 0.00141627 hartree
thermaltotal: -1322.93524387 hartree
thermalcorr: 0.02674747 hartree
nonthermalcorr: 0.44899857 hartree
totalcorr: 0.47574604 hartree
thermalcorrenthalpy: 0.00094421 hartree
totalenthalpy: -1322.93429966 hartree
vibrat: 0.04247842 hartree
rotat: 0.01705810 hartree
transl: 0.02084687 hartree
total: 0.08142068 hartree
totalentropycorr: -0.08142068 hartree
gibbsenthalpy: -1323.01572033 hartree
gibbsminuselec: 0.39526957 hartree
