program: Orca
programVersion: 6.0.1
elementType: C C C C C C H C C C C C O C O C O C O C C C C C C C C C C N H H H H H H H H C H H H H H H H H H H H H H H H H
charge: 0
multiplicity: 3
keywords: UKS wB97X-D3 def2-TZVP def2/J RIJCOSX CPCM(Toluene) IRC
formula: C25H25NO4
InChI: InChI=1/C25H25NO4/c1-5-16-14-25(23(27)29-3,24(28)30-4)21-20(16)19(17-9-7-6-8-10-17)13-18-12-11-15(2)26-22(18)21/h5-13,16,20-21H,1,14H2,2-4H3
55 atoms
C  1.194678 4.602012 1.219969
C  0.259889 3.554207 0.694843
C  -0.975715 3.87748 0.140241
C  -1.789931 2.864808 -0.319357
C  -1.36808 1.536377 -0.230088
C  -2.186818 0.42293 -0.666056
H  -1.268224 -3.127809 1.356756
C  -1.307415 -0.251418 -2.498077
C  -0.172894 -1.002416 -1.812558
C  1.193925 -0.302721 -1.950529
C  1.777079 -0.220289 -0.530451
C  2.779005 0.923778 -0.37704
O  3.432931 0.817333 0.776708
C  4.351905 1.865932 1.08139
O  2.984682 1.779669 -1.194604
C  2.536193 -1.499859 -0.161107
O  3.559394 -1.690975 -0.991747
C  4.386198 -2.826989 -0.72553
O  2.27249 -2.240848 0.748315
C  0.512162 -0.087776 0.356086
C  -0.424369 -1.142642 -0.280934
C  -1.853629 -0.853079 -0.001778
C  -2.706242 -1.581859 0.848831
C  -4.04159 -1.163048 1.09281
C  -4.880943 -1.886319 1.912773
C  -4.440199 -3.056073 2.52775
C  -3.132249 -3.48661 2.311223
C  -2.280641 -2.772267 1.497638
C  -0.083816 1.309025 0.301951
N  0.678321 2.289882 0.763628
H  0.731389 5.588069 1.223074
H  2.093064 4.64262 0.599467
H  1.507007 4.353783 2.235535
H  -1.291788 4.911768 0.085166
H  -2.765704 3.087921 -0.737324
H  -3.20339 0.65061 -0.958113
H  -3.035106 -0.407248 -3.752866
H  -2.430338 -1.998389 -3.023006
C  -2.298318 -0.93029 -3.155888
H  -0.131161 -2.002946 -2.244462
H  1.074489 0.716886 -2.318265
H  1.865573 -0.811607 -2.639101
H  4.792553 1.603137 2.038933
H  3.818548 2.813448 1.154852
H  5.120464 1.937469 0.312399
H  3.799423 -3.743558 -0.774423
H  4.840313 -2.738586 0.261041
H  5.14985 -2.821702 -1.497895
H  0.745203 -0.331297 1.393165
H  -0.108711 -2.123512 0.062211
H  -4.408762 -0.257681 0.62647
H  -5.894268 -1.538773 2.077936
H  -5.10421 -3.62432 3.167262
H  -2.775554 -4.392092 2.788344
H  -1.096663 0.765856 -2.815566
elementType: C H O N
totalener: -1323.37753204381124 hartree
nucrepener: 3047.01967303971151 hartree
electener: -4370.38371360160363 hartree
oneelecener: -7861.18266620429131 hartree
twoeener: 3490.79895260268768 hartree
cpcmener: -0.01352876981594 hartree
kineticenergy: 1317.60323437648753 hartree
xcener: -128.505078653626 hartree
s2: 2.111708
energy: -524.8490 -524.6733 -523.2339 -523.0452 -392.2967 -283.4702 -283.3569 -281.0869 -280.9394 -280.9242 -280.8581 -280.7985 -280.2683 -280.2189 -280.1582 -280.1581 -280.1047 -280.0522 -280.0352 -279.9292 -279.8797 -279.7880 -279.7152 -279.7084 -279.7014 -279.6723 -279.6526 -279.6393 -279.4427 -279.4131 -33.8348 -33.5177 -31.2277 -31.0665 -29.2465 -27.5031 -26.6898 -25.9834 -25.0843 -24.9644 -24.4561 -23.8401 -23.5456 -23.2675 -23.1444 -22.6670 -22.4921 -21.7649 -20.5433 -20.3943 -19.7103 -19.6655 -19.2902 -19.0536 -18.8050 -18.2254 -18.0235 -17.6223 -17.4793 -17.1718 -17.0024 -16.4413 -16.4316 -16.2052 -15.9890 -15.8731 -15.7698 -15.5561 -15.2256 -15.0669 -14.9651 -14.7698 -14.6683 -14.5286 -14.3973 -14.2807 -14.1397 -14.0042 -13.7490 -13.7296 -13.5796 -13.4475 -13.2303 -13.1064 -12.9317 -12.9183 -12.8558 -12.7498 -12.5350 -12.4014 -12.1671 -12.1214 -11.9267 -11.7746 -11.5780 -11.2953 -11.2379 -11.0283 -10.9090 -10.6480 -10.3399 -10.1607 -10.0548 -9.5841 -9.5512 -9.2989 -7.4733 -6.2475 0.9999 1.4673 1.7344 2.0530 2.2066 2.7381 3.0609 3.2344 3.4733 3.5015 3.8410 electronvolt
energy: -524.8488 -524.6730 -523.2338 -523.0451 -392.3245 -283.4702 -283.3562 -281.0868 -280.9394 -280.8861 -280.8186 -280.7957 -280.2038 -280.1347 -280.1172 -280.1034 -280.0981 -280.0945 -279.9723 -279.9118 -279.8963 -279.8086 -279.7095 -279.6983 -279.6839 -279.6425 -279.6305 -279.5910 -279.4155 -279.2981 -33.8342 -33.5170 -31.2273 -31.0660 -29.2144 -27.3439 -26.5862 -25.7888 -25.0025 -24.8888 -24.2756 -23.7300 -23.4533 -23.1571 -23.0863 -22.5485 -22.3396 -21.5662 -20.4728 -20.0868 -19.6183 -19.5498 -19.1972 -18.9436 -18.7797 -18.0936 -18.0021 -17.5800 -17.3943 -17.0722 -16.9567 -16.4108 -16.3531 -16.1671 -15.9287 -15.8503 -15.7596 -15.4367 -15.1766 -14.9917 -14.8195 -14.6958 -14.5872 -14.4547 -14.3396 -14.1415 -14.0437 -13.8506 -13.7216 -13.6858 -13.5002 -13.2875 -13.0874 -12.9655 -12.9014 -12.8547 -12.7513 -12.5778 -12.4943 -12.3250 -12.1088 -12.0551 -11.8369 -11.6900 -11.5406 -11.2688 -11.0786 -11.0230 -10.6623 -10.5104 -10.1141 -9.9088 -9.5902 -9.4967 -9.2458 -8.6994 -0.9242 0.2197 1.1941 1.8586 1.9719 2.0819 2.5987 2.9739 3.1472 3.4649 3.5450 electronvolt
chargesum: 0.0000000
charge: -0.420414 0.220044 -0.194377 -0.195449 -0.014300 -0.039783 0.145783 -0.179329 -0.056343 -0.332917 0.353409 0.246401 -0.253594 -0.230525 -0.370803 0.233925 -0.272068 -0.229572 -0.379269 0.138729 0.030815 -0.048375 0.160058 -0.257217 -0.151637 -0.149037 -0.145900 -0.270695 -0.055268 -0.364407 0.134846 0.149322 0.145043 0.148500 0.145591 0.167655 0.145520 0.152567 -0.348093 0.099003 0.150863 0.146601 0.147834 0.133643 0.145434 0.143809 0.146209 0.150329 0.133917 0.144626 0.136011 0.137868 0.143209 0.139567 0.142243
charge: -0.258835 -0.237295 -0.127187 -0.079019 -0.127259 -0.048526 0.151496 -0.175034 -0.166667 -0.152781 -0.168491 -0.450433 0.268420 -0.299548 0.105863 -0.435561 0.262491 -0.296343 0.107489 -0.099293 -0.139472 -0.048191 -0.134904 -0.099466 -0.153054 -0.149269 -0.152297 -0.097448 -0.132244 0.190310 0.128344 0.133963 0.133286 0.153535 0.156470 0.149424 0.119865 0.123437 -0.199501 0.161591 0.154752 0.145148 0.117398 0.114060 0.115377 0.116057 0.117288 0.117851 0.173872 0.161996 0.149966 0.149086 0.146254 0.149602 0.153429
qa: -0.4204 0.2200 -0.1944 -0.1954 -0.0143 -0.0398 0.1458 -0.1793 -0.0563 -0.3329 0.3534 0.2464 -0.2536 -0.2305 -0.3708 0.2339 -0.2721 -0.2296 -0.3793 0.1387 0.0308 -0.0484 0.1601 -0.2572 -0.1516 -0.1490 -0.1459 -0.2707 -0.0553 -0.3644 0.1348 0.1493 0.1450 0.1485 0.1456 0.1677 0.1455 0.1526 -0.3481 0.0990 0.1509 0.1466 0.1478 0.1336 0.1454 0.1438 0.1462 0.1503 0.1339 0.1446 0.1360 0.1379 0.1432 0.1396 0.1422
va: 3.8718 3.8135 3.9261 4.0179 3.9268 3.6206 0.9851 3.9184 4.0890 4.0725 3.5141 4.3196 2.1032 3.8809 2.1318 4.2648 2.1337 3.8651 2.1266 4.0810 3.9881 3.4436 3.5599 3.9527 3.9366 3.8714 3.9062 3.9761 4.0314 3.0264 0.9703 0.9637 0.9696 0.9692 0.9741 0.9535 0.9752 0.9709 3.8937 0.9708 0.9856 0.9755 0.9673 0.9643 0.9688 0.9669 0.9669 0.9664 0.9843 0.9481 0.9799 0.9701 0.9663 0.9697 0.9706
dispersion: -0.033457807 hartree
energy: -1323.410989850851 hartree
dipole: 0.455417104 -0.449085613 0.006331491 1.856455552 -1.570735156 0.285720396 -2.117957452 1.941344173 -0.176613279
dipolemethod: SCF
magnitude: 0.335959049 au
magnitude: 0.853940040 debye
temp: 298.15 k
press: 1.00 atm
zeropoint: 0.44899829 hartree
thermalvibcorrection: 0.02391459 hartree
thermalrotcorrection: 0.00141627 hartree
thermaltrasncorrection: 0.00141627 hartree
thermaltotal: -1322.93524443 hartree
thermalcorr: 0.02674714 hartree
nonthermalcorr: 0.44899829 hartree
totalcorr: 0.47574542 hartree
thermalcorrenthalpy: 0.00094421 hartree
totalenthalpy: -1322.93430022 hartree
vibrat: 0.04247675 hartree
rotat: 0.01705810 hartree
transl: 0.02084687 hartree
total: 0.08141901 hartree
totalentropycorr: -0.08141901 hartree
gibbsenthalpy: -1323.01571922 hartree
gibbsminuselec: 0.39527063 hartree
