program: Orca
programVersion: 6.0.1
elementType: C C C C C C H C C C C C O C O C O C O C C C C C C C C C C N H H H H H H H H C H H H H H H H H H H H H H H H H
charge: 0
multiplicity: 3
keywords: UKS wB97X-D3 def2-TZVP def2/J RIJCOSX CPCM(Toluene) TightSCF Freq OptTS VeryTightOpt SlowConv
frequency: 0.00 0.00 0.00 0.00 0.00 0.00 -698.14 -4.57 24.08 49.36 55.37 59.52 79.11 83.44 91.75 99.32 121.02 133.45 143.65 149.69 156.56 162.35 173.04 181.56 215.37 230.25 231.29 248.17 263.63 286.28 307.30 317.14 324.22 328.14 342.93 378.39 382.34 417.28 420.19 440.89 445.33 477.50 512.72 524.29 530.78 541.91 589.28 597.63 628.46 629.69 647.08 678.86 687.29 692.36 720.61 726.02 753.34 776.79 779.90 791.24 815.48 827.00 832.01 837.21 845.12 854.84 864.26 872.63 905.91 926.93 941.36 945.16 967.80 980.64 982.31 997.22 999.07 1000.27 1005.42 1007.13 1026.01 1033.34 1052.09 1063.05 1064.42 1069.19 1086.77 1115.42 1124.64 1140.16 1157.93 1167.98 1175.65 1177.40 1180.02 1198.74 1205.12 1215.87 1220.07 1221.66 1229.02 1241.60 1261.62 1268.15 1277.72 1284.50 1289.91 1293.56 1300.68 1309.70 1321.70 1327.59 1336.71 1346.82 1353.11 1360.43 1388.91 1410.57 1438.51 1454.30 1473.21 1473.88 1475.99 1479.01 1481.04 1483.27 1483.65 1490.44 1491.42 1493.32 1502.50 1504.22 1528.07 1568.23 1598.00 1620.03 1626.66 1651.20 1800.85 1826.59 3062.22 3063.30 3078.82 3079.56 3104.32 3112.71 3131.68 3137.84 3151.19 3157.58 3159.90 3161.65 3162.67 3177.65 3190.90 3192.94 3194.32 3194.90 3201.03 3217.39 3218.50 3222.88 3231.34 3232.33 3237.68
frequency: 24.08 49.36 55.37 59.52 79.11 83.44 91.75 99.32 121.02 133.45 143.65 149.69 156.56 162.35 173.04 181.56 215.37 230.25 231.29 248.17 263.63 286.28 307.30 317.14 324.22 328.14 342.93 378.39 382.34 417.28 420.19 440.89 445.33 477.50 512.72 524.29 530.78 541.91 589.28 597.63 628.46 629.69 647.08 678.86 687.29 692.36 720.61 726.02 753.34 776.79 779.90 791.24 815.48 827.00 832.01 837.21 845.12 854.84 864.26 872.63 905.91 926.93 941.36 945.16 967.80 980.64 982.31 997.22 999.07 1000.27 1005.42 1007.13 1026.01 1033.34 1052.09 1063.05 1064.42 1069.19 1086.77 1115.42 1124.64 1140.16 1157.93 1167.98 1175.65 1177.40 1180.02 1198.74 1205.12 1215.87 1220.07 1221.66 1229.02 1241.60 1261.62 1268.15 1277.72 1284.50 1289.91 1293.56 1300.68 1309.70 1321.70 1327.59 1336.71 1346.82 1353.11 1360.43 1388.91 1410.57 1438.51 1454.30 1473.21 1473.88 1475.99 1479.01 1481.04 1483.27 1483.65 1490.44 1491.42 1493.32 1502.50 1504.22 1528.07 1568.23 1598.00 1620.03 1626.66 1651.20 1800.85 1826.59 3062.22 3063.30 3078.82 3079.56 3104.32 3112.71 3131.68 3137.84 3151.19 3157.58 3159.90 3161.65 3162.67 3177.65 3190.90 3192.94 3194.32 3194.90 3201.03 3217.39 3218.50 3222.88 3231.34 3232.33 3237.68
formula: C25H25NO4
InChI: InChI=1/C25H25NO4/c1-5-16-14-25(23(27)29-3,24(28)30-4)21-20(16)19(17-9-7-6-8-10-17)13-18-12-11-15(2)26-22(18)21/h5-13,16,20-21H,1,14H2,2-4H3
55 atoms
C  1.38443 4.679385 0.669422
C  0.334058 3.630257 0.455488
C  -1.011022 3.958899 0.298808
C  -1.921737 2.949851 0.084311
C  -1.498474 1.618997 0.030252
C  -2.409952 0.549226 -0.27621
H  -1.343963 -3.425581 0.640236
C  -0.979637 0.118892 -2.563705
C  -0.223113 -0.99467 -1.896578
C  1.297682 -0.783374 -1.94504
C  1.743315 -0.325256 -0.528968
C  2.731749 0.84255 -0.587704
O  3.400237 0.947186 0.558125
C  4.333197 2.021953 0.646019
O  2.931372 1.532959 -1.55061
C  2.481058 -1.480378 0.160734
O  3.598421 -1.779876 -0.499776
C  4.397394 -2.830375 0.049018
O  2.115278 -2.06851 1.143786
C  0.428704 -0.035965 0.247502
C  -0.532726 -1.072518 -0.373955
C  -1.951749 -0.830027 0.031229
C  -2.745306 -1.760946 0.727402
C  -4.041823 -1.41616 1.207093
C  -4.827492 -2.324277 1.882683
C  -4.378778 -3.622288 2.113337
C  -3.114468 -3.99245 1.6541
C  -2.315319 -3.095655 0.982841
C  -0.117576 1.381211 0.195872
N  0.745824 2.365153 0.411293
H  0.943876 5.670334 0.774901
H  2.073826 4.695017 -0.17795
H  1.967338 4.45632 1.564715
H  -1.327768 4.993376 0.346086
H  -2.974761 3.176529 -0.045759
H  -3.464531 0.785507 -0.25426
H  -2.846535 1.084332 -2.861245
H  -2.940441 -0.653089 -2.262715
C  -2.331379 0.227904 -2.441516
H  -0.502884 -1.94592 -2.359299
H  1.571786 -0.020047 -2.67152
H  1.820386 -1.694962 -2.229386
H  4.777996 1.948497 1.634562
H  3.815186 2.973515 0.531421
H  5.097789 1.925759 -0.124567
H  3.843775 -3.768919 0.046042
H  4.692334 -2.585542 1.068895
H  5.270484 -2.901486 -0.593393
H  0.592624 -0.271676 1.300889
H  -0.199192 -2.048727 -0.030087
H  -4.421102 -0.415497 1.051115
H  -5.805691 -2.019674 2.23656
H  -5.000963 -4.333472 2.64222
H  -2.752235 -4.999448 1.826163
H  -0.409504 0.963159 -2.938877
totalener: -1323.37091277243940 hartree
nucrepener: 3049.57460969540125 hartree
electener: -4372.93201769924144 hartree
oneelecener: -7866.46168206564471 hartree
twoeener: 3493.52966436640327 hartree
cpcmener: -0.01349530998261 hartree
kineticenergy: 1317.59888735145091 hartree
xcener: -128.509777634651 hartree
s2: 2.109191
dispersion: -0.033737783 hartree
s2: 2.109166
dispersion: -0.033785066 hartree
s2: 2.110187
dispersion: -0.033905468 hartree
s2: 2.109627
dispersion: -0.033708760 hartree
s2: 2.111088
dispersion: -0.033712706 hartree
s2: 2.110728
dispersion: -0.033920081 hartree
s2: 2.111437
dispersion: -0.033788588 hartree
s2: 2.110797
dispersion: -0.033793116 hartree
s2: 2.111224
dispersion: -0.033721737 hartree
s2: 2.110254
dispersion: -0.033706529 hartree
s2: 2.109257
dispersion: -0.033728325 hartree
s2: 2.109640
dispersion: -0.033738148 hartree
s2: 2.108789
dispersion: -0.033769253 hartree
s2: 2.108882
dispersion: -0.033739064 hartree
s2: 2.109401
dispersion: -0.033736394 hartree
s2: 2.109458
dispersion: -0.033751632 hartree
s2: 2.109174
dispersion: -0.033738616 hartree
s2: 2.109158
dispersion: -0.033738733 hartree
s2: 2.109171
dispersion: -0.033738142 hartree
s2: 2.109150
dispersion: -0.033739257 hartree
s2: 2.109218
dispersion: -0.033737283 hartree
s2: 2.109192
dispersion: -0.033738120 hartree
s2: 2.109207
dispersion: -0.033738759 hartree
s2: 2.109208
dispersion: -0.033737124 hartree
s2: 2.109200
dispersion: -0.033738381 hartree
s2: 2.109221
dispersion: -0.033736702 hartree
s2: 2.109190
dispersion: -0.033738249 hartree
s2: 2.109232
dispersion: -0.033735543 hartree
s2: 2.109173
dispersion: -0.033737834 hartree
s2: 2.109231
dispersion: -0.033736041 hartree
s2: 2.109172
dispersion: -0.033738156 hartree
s2: 2.109250
dispersion: -0.033735579 hartree
s2: 2.109163
dispersion: -0.033737901 hartree
s2: 2.109244
dispersion: -0.033735799 hartree
s2: 2.109152
dispersion: -0.033739393 hartree
s2: 2.109526
dispersion: -0.033742175 hartree
s2: 2.108874
dispersion: -0.033748304 hartree
s2: 2.108924
dispersion: -0.033741327 hartree
s2: 2.109128
dispersion: -0.033741087 hartree
s2: 2.109361
dispersion: -0.033730686 hartree
s2: 2.109253
dispersion: -0.033737011 hartree
s2: 2.109296
dispersion: -0.033738929 hartree
dispersion: -0.033738329 hartree
s2: 2.109224
dispersion: -0.033737363 hartree
s2: 2.109212
dispersion: -0.033736628 hartree
dispersion: -0.033738654 hartree
s2: 2.109220
dispersion: -0.033735906 hartree
s2: 2.109205
dispersion: -0.033738326 hartree
dispersion: -0.033735813 hartree
s2: 2.109203
dispersion: -0.033738328 hartree
s2: 2.109226
dispersion: -0.033735018 hartree
dispersion: -0.033739688 hartree
s2: 2.109216
dispersion: -0.033736934 hartree
s2: 2.109194
dispersion: -0.033737712 hartree
dispersion: -0.033736624 hartree
s2: 2.109222
dispersion: -0.033736871 hartree
dispersion: -0.033737581 hartree
s2: 2.109211
s2: 2.109201
dispersion: -0.033737239 hartree
elementType: C H O N
energy: -524.7906 -524.5865 -523.2063 -522.9618 -392.2069 -283.4284 -283.3061 -281.0642 -280.8883 -280.8580 -280.8017 -280.7783 -280.2696 -280.2581 -280.1715 -280.0734 -280.0645 -279.9736 -279.9588 -279.9414 -279.7452 -279.7279 -279.7258 -279.7052 -279.7000 -279.6837 -279.6762 -279.6613 -279.6512 -279.3880 -33.7956 -33.4447 -31.1927 -30.9934 -29.1475 -27.3891 -26.6882 -25.9240 -25.0446 -24.9589 -24.5156 -23.8742 -23.5604 -23.2676 -23.0756 -22.6273 -22.4384 -21.8461 -20.4919 -20.3389 -19.6884 -19.6332 -19.1730 -19.0859 -18.7347 -18.4409 -17.9627 -17.6547 -17.3568 -17.1905 -16.9237 -16.4307 -16.3847 -16.1833 -15.9501 -15.8164 -15.7094 -15.5690 -15.2278 -15.0917 -14.8092 -14.7166 -14.6567 -14.6254 -14.4057 -14.2305 -14.1424 -13.9429 -13.7325 -13.6705 -13.5135 -13.4290 -13.2175 -13.1760 -13.0306 -12.8517 -12.7995 -12.7332 -12.5829 -12.3289 -12.1614 -12.1264 -12.0115 -11.8818 -11.5649 -11.3107 -11.2132 -11.0251 -10.9151 -10.6087 -10.3514 -10.1443 -10.0397 -9.5964 -9.4662 -8.8225 -7.7823 -5.8590 0.9811 1.6280 1.7090 2.2085 2.3377 2.5672 3.0283 3.3249 3.4527 3.5046 3.8825 electronvolt
energy: -524.7905 -524.5862 -523.2058 -522.9618 -392.2310 -283.4285 -283.3053 -281.0642 -280.8883 -280.8197 -280.8001 -280.7417 -280.1603 -280.1129 -280.1007 -280.0785 -280.0441 -279.9842 -279.9756 -279.9396 -279.7984 -279.7185 -279.7077 -279.6967 -279.6754 -279.6556 -279.6504 -279.5986 -279.5684 -279.3903 -33.7950 -33.4440 -31.1918 -30.9929 -29.1130 -27.2160 -26.5765 -25.7171 -24.9386 -24.8452 -24.2950 -23.7710 -23.4677 -23.1534 -23.0409 -22.5089 -22.3563 -21.6662 -20.3949 -20.0697 -19.6341 -19.5881 -19.0848 -18.9795 -18.6948 -18.2269 -17.9452 -17.6105 -17.2742 -17.0770 -16.8374 -16.3953 -16.3063 -16.1535 -15.8936 -15.7844 -15.6966 -15.4617 -15.1882 -15.0131 -14.7491 -14.6468 -14.5498 -14.5053 -14.3744 -14.1902 -14.0603 -13.7178 -13.6939 -13.6185 -13.4062 -13.2223 -13.1213 -12.9924 -12.8803 -12.8224 -12.7522 -12.6026 -12.3160 -12.2586 -12.0947 -12.0622 -11.9717 -11.8109 -11.4537 -11.1991 -10.9778 -10.9460 -10.7323 -10.5826 -10.0546 -9.9581 -9.5199 -9.4465 -9.2628 -8.5005 -1.2134 0.4534 1.1586 1.9071 2.1081 2.2163 2.6477 2.9406 3.1827 3.4756 3.5068 electronvolt
chargesum: -0.0000000
charge: -0.439676 0.222840 -0.218287 -0.178173 0.029732 -0.176107 0.140650 -0.219629 -0.008758 -0.294402 0.355976 0.281005 -0.260226 -0.231767 -0.377786 0.220406 -0.277973 -0.228723 -0.380846 0.083057 0.067250 -0.014772 0.162997 -0.259073 -0.153388 -0.154644 -0.144202 -0.258051 -0.029384 -0.360661 0.136995 0.152578 0.148065 0.145717 0.141944 0.174482 0.143326 0.162978 -0.284575 0.098619 0.145696 0.133494 0.146814 0.129533 0.145776 0.143052 0.146063 0.149899 0.134433 0.109024 0.129380 0.138033 0.143643 0.139329 0.148316
charge: -0.261083 -0.240940 -0.132284 -0.080103 -0.135373 -0.061962 0.150015 -0.150003 -0.191864 -0.148759 -0.153871 -0.453456 0.267109 -0.301891 0.100055 -0.441567 0.261419 -0.297894 0.104126 -0.100411 -0.138472 -0.048635 -0.135969 -0.102607 -0.154285 -0.148996 -0.153381 -0.099157 -0.135986 0.193484 0.128296 0.134251 0.132013 0.152565 0.155983 0.150884 0.130609 0.144331 -0.179083 0.163018 0.151211 0.145912 0.116928 0.113346 0.115180 0.115769 0.117301 0.117742 0.179602 0.167104 0.148881 0.149213 0.146139 0.149624 0.145919
qa: -0.4397 0.2228 -0.2183 -0.1782 0.0297 -0.1761 0.1407 -0.2196 -0.0088 -0.2944 0.3560 0.2810 -0.2602 -0.2318 -0.3778 0.2204 -0.2780 -0.2287 -0.3808 0.0831 0.0672 -0.0148 0.1630 -0.2591 -0.1534 -0.1546 -0.1442 -0.2581 -0.0294 -0.3607 0.1370 0.1526 0.1481 0.1457 0.1419 0.1745 0.1433 0.1630 -0.2846 0.0986 0.1457 0.1335 0.1468 0.1295 0.1458 0.1431 0.1461 0.1499 0.1344 0.1090 0.1294 0.1380 0.1436 0.1393 0.1483
va: 3.8695 3.8071 3.9388 4.0046 3.8840 3.8032 0.9826 3.8772 4.1289 4.0000 3.6117 4.2886 2.0973 3.8829 2.1229 4.2968 2.1223 3.8669 2.1266 4.0953 3.9255 3.4681 3.6431 3.9478 3.9532 3.8754 3.9092 3.9622 3.9778 3.0148 0.9704 0.9624 0.9644 0.9712 0.9742 0.9507 0.9734 0.9602 3.9394 0.9610 0.9867 0.9759 0.9670 0.9647 0.9697 0.9666 0.9674 0.9665 0.9769 0.9648 0.9866 0.9697 0.9661 0.9691 0.9721
dispersion: -0.033737158 hartree
energy: -1323.404650113408 hartree
dipole: 1.209237111 -1.343745864 -0.134508753 2.544480947 -2.361213453 0.183267494 -1.368037256 1.333555149 -0.034482106
dipolemethod: SCF
magnitude: 0.229931717 au
magnitude: 0.584439978 debye
temp: 298.15 k
press: 1.00 atm
zeropoint: 0.44960429 hartree
thermalvibcorrection: 0.02269845 hartree
thermalrotcorrection: 0.00141627 hartree
thermaltrasncorrection: 0.00141627 hartree
thermaltotal: -1322.92951484 hartree
thermalcorr: 0.02553099 hartree
nonthermalcorr: 0.44960429 hartree
totalcorr: 0.47513528 hartree
thermalcorrenthalpy: 0.00094421 hartree
totalenthalpy: -1322.92857063 hartree
vibrat: 0.03972296 hartree
rotat: 0.01705561 hartree
transl: 0.02084687 hartree
total: 0.07866273 hartree
totalentropycorr: -0.07866273 hartree
gibbsenthalpy: -1323.00723336 hartree
gibbsminuselec: 0.39741675 hartree
