program: Orca
programVersion: 6.0.1
elementType: C C C C C C H C C C C C O C O C O C O C C C C C C C C C C N H H H H H H H H C H H H H H H H H H H H H H H H H
charge: 0
multiplicity: 3
keywords: UKS wB97X-D3 def2-TZVP def2/J RIJCOSX CPCM(Toluene) IRC
formula: C25H25NO4
InChI: InChI=1/C25H25NO4/c1-5-16-14-25(23(27)29-3,24(28)30-4)21-20(16)19(17-9-7-6-8-10-17)13-18-12-11-15(2)26-22(18)21/h5-13,16,20-21H,1,14H2,2-4H3
55 atoms
C  1.38336 4.6785 0.670189
C  0.333121 3.629482 0.455086
C  -1.011878 3.958177 0.297785
C  -1.922463 2.949206 0.082349
C  -1.499173 1.618388 0.028048
C  -2.410556 0.548636 -0.27906
H  -1.342656 -3.424834 0.641913
C  -0.979371 0.119499 -2.566368
C  -0.222564 -0.99379 -1.899203
C  1.298191 -0.781542 -1.946697
C  1.742999 -0.325327 -0.529794
C  2.731821 0.842275 -0.586315
O  3.398771 0.945842 0.560502
C  4.331955 2.020253 0.650473
O  2.933063 1.533252 -1.548472
C  2.479985 -1.481329 0.159265
O  3.598049 -1.78001 -0.500429
C  4.396381 -2.83127 0.04784
O  2.113204 -2.070627 1.141241
C  0.427951 -0.03661 0.245986
C  -0.533027 -1.072786 -0.376787
C  -1.952044 -0.830475 0.028562
C  -2.744493 -1.760519 0.727282
C  -4.040621 -1.415268 1.207604
C  -4.825198 -2.322248 1.885976
C  -4.375702 -3.619582 2.118863
C  -3.111791 -3.990219 1.658955
C  -2.313777 -3.094546 0.984831
C  -0.118383 1.380532 0.19444
N  0.744897 2.364397 0.410719
H  0.942887 5.669667 0.773855
H  2.074497 4.69307 -0.17577
H  1.964387 4.456116 1.566885
H  -1.328662 4.992632 0.345302
H  -2.97543 3.175924 -0.048128
H  -3.465154 0.784883 -0.257265
H  -2.846753 1.083909 -2.864128
H  -2.939774 -0.653667 -2.265863
C  -2.331179 0.22769 -2.444477
H  -0.501399 -1.944998 -2.362588
H  1.572078 -0.016843 -2.671817
H  1.821564 -1.69233 -2.23234
H  4.775386 1.945941 1.639566
H  3.814375 2.972055 0.535887
H  5.09755 1.92441 -0.119164
H  3.842542 -3.769671 0.043641
H  4.69075 -2.587455 1.068127
H  5.269873 -2.901958 -0.594068
H  0.591102 -0.27283 1.299381
H  -0.199581 -2.049282 -0.033673
H  -4.420458 -0.415095 1.049859
H  -5.803133 -2.0173 2.240269
H  -4.996945 -4.329816 2.650122
H  -2.748955 -4.996695 1.832765
H  -0.409619 0.96419 -2.941158
elementType: C H O N
totalener: -1323.37091269662733 hartree
nucrepener: 3049.57460969540125 hartree
electener: -4372.93201790820785 hartree
oneelecener: -7866.46173985867335 hartree
twoeener: 3493.52972195046596 hartree
cpcmener: -0.01349505590910 hartree
kineticenergy: 1317.59884968098913 hartree
xcener: -128.509773050082 hartree
s2: 2.109187
energy: -524.7905 -524.5863 -523.2064 -522.9611 -392.2072 -283.4284 -283.3059 -281.0641 -280.8882 -280.8580 -280.8013 -280.7785 -280.2694 -280.2579 -280.1712 -280.0735 -280.0646 -279.9733 -279.9590 -279.9410 -279.7445 -279.7277 -279.7256 -279.7046 -279.7003 -279.6837 -279.6760 -279.6612 -279.6511 -279.3882 -33.7956 -33.4445 -31.1928 -30.9930 -29.1478 -27.3889 -26.6882 -25.9240 -25.0444 -24.9591 -24.5156 -23.8740 -23.5603 -23.2675 -23.0755 -22.6273 -22.4380 -21.8460 -20.4921 -20.3387 -19.6884 -19.6330 -19.1731 -19.0860 -18.7345 -18.4409 -17.9627 -17.6545 -17.3564 -17.1904 -16.9236 -16.4306 -16.3848 -16.1831 -15.9500 -15.8162 -15.7093 -15.5691 -15.2277 -15.0918 -14.8089 -14.7163 -14.6565 -14.6255 -14.4056 -14.2305 -14.1424 -13.9430 -13.7325 -13.6703 -13.5133 -13.4287 -13.2176 -13.1760 -13.0306 -12.8518 -12.7995 -12.7331 -12.5831 -12.3289 -12.1612 -12.1265 -12.0115 -11.8815 -11.5649 -11.3101 -11.2133 -11.0245 -10.9150 -10.6087 -10.3515 -10.1443 -10.0394 -9.5962 -9.4664 -8.8225 -7.7809 -5.8606 0.9811 1.6281 1.7091 2.2083 2.3377 2.5677 3.0285 3.3245 3.4526 3.5048 3.8825 electronvolt
energy: -524.7904 -524.5861 -523.2060 -522.9612 -392.2313 -283.4285 -283.3051 -281.0641 -280.8882 -280.8197 -280.7997 -280.7419 -280.1599 -280.1129 -280.1004 -280.0783 -280.0442 -279.9843 -279.9753 -279.9393 -279.7977 -279.7187 -279.7076 -279.6967 -279.6753 -279.6554 -279.6502 -279.5987 -279.5679 -279.3905 -33.7950 -33.4438 -31.1919 -30.9926 -29.1133 -27.2159 -26.5766 -25.7171 -24.9384 -24.8453 -24.2951 -23.7708 -23.4677 -23.1533 -23.0408 -22.5088 -22.3560 -21.6661 -20.3951 -20.0693 -19.6341 -19.5879 -19.0848 -18.9795 -18.6946 -18.2269 -17.9452 -17.6103 -17.2739 -17.0769 -16.8372 -16.3952 -16.3064 -16.1532 -15.8935 -15.7842 -15.6964 -15.4618 -15.1881 -15.0132 -14.7488 -14.6465 -14.5499 -14.5051 -14.3744 -14.1901 -14.0602 -13.7179 -13.6940 -13.6182 -13.4059 -13.2221 -13.1212 -12.9926 -12.8805 -12.8225 -12.7520 -12.6027 -12.3160 -12.2585 -12.0946 -12.0623 -11.9716 -11.8107 -11.4536 -11.1990 -10.9774 -10.9458 -10.7318 -10.5825 -10.0544 -9.9580 -9.5200 -9.4467 -9.2627 -8.5007 -1.2119 0.4529 1.1585 1.9072 2.1080 2.2161 2.6482 2.9408 3.1827 3.4754 3.5071 electronvolt
chargesum: -0.0000000
charge: -0.439696 0.222790 -0.218188 -0.177983 0.029920 -0.176147 0.140720 -0.219159 -0.009506 -0.294205 0.356225 0.280887 -0.260282 -0.231684 -0.377786 0.220250 -0.277945 -0.228721 -0.380842 0.083690 0.067118 -0.014837 0.163268 -0.259129 -0.153660 -0.154381 -0.143764 -0.258818 -0.029680 -0.360588 0.136970 0.152568 0.148038 0.145700 0.141940 0.174509 0.143318 0.162951 -0.284734 0.098559 0.145669 0.133446 0.146866 0.129479 0.145745 0.143044 0.146055 0.149885 0.134431 0.109084 0.129354 0.138021 0.143683 0.139263 0.148285
charge: -0.261075 -0.240936 -0.132275 -0.080102 -0.135344 -0.061965 0.150022 -0.150084 -0.191851 -0.148733 -0.153927 -0.453483 0.267102 -0.301885 0.100051 -0.441543 0.261430 -0.297892 0.104138 -0.100440 -0.138458 -0.048652 -0.135947 -0.102594 -0.154280 -0.148988 -0.153362 -0.099148 -0.135955 0.193520 0.128292 0.134243 0.132025 0.152566 0.155986 0.150875 0.130602 0.144324 -0.179122 0.163020 0.151220 0.145900 0.116927 0.113345 0.115179 0.115769 0.117300 0.117742 0.179600 0.167098 0.148883 0.149213 0.146141 0.149625 0.145908
qa: -0.4397 0.2228 -0.2182 -0.1780 0.0299 -0.1761 0.1407 -0.2192 -0.0095 -0.2942 0.3562 0.2809 -0.2603 -0.2317 -0.3778 0.2203 -0.2779 -0.2287 -0.3808 0.0837 0.0671 -0.0148 0.1633 -0.2591 -0.1537 -0.1544 -0.1438 -0.2588 -0.0297 -0.3606 0.1370 0.1526 0.1480 0.1457 0.1419 0.1745 0.1433 0.1630 -0.2847 0.0986 0.1457 0.1334 0.1469 0.1295 0.1457 0.1430 0.1461 0.1499 0.1344 0.1091 0.1294 0.1380 0.1437 0.1393 0.1483
va: 3.8696 3.8072 3.9388 4.0044 3.8834 3.8019 0.9826 3.8768 4.1301 4.0001 3.6118 4.2884 2.0973 3.8830 2.1228 4.2970 2.1224 3.8669 2.1266 4.0943 3.9259 3.4678 3.6424 3.9480 3.9533 3.8753 3.9093 3.9629 3.9779 3.0151 0.9704 0.9624 0.9644 0.9712 0.9742 0.9507 0.9734 0.9601 3.9396 0.9609 0.9867 0.9759 0.9669 0.9648 0.9697 0.9666 0.9674 0.9665 0.9769 0.9646 0.9866 0.9697 0.9661 0.9691 0.9721
dispersion: -0.033737783 hartree
energy: -1323.404650479874 hartree
dipole: 1.210833653 -1.345893004 -0.135059350 2.547996857 -2.364490236 0.183506621 -1.357422127 1.324434302 -0.032987825
dipolemethod: SCF
magnitude: 0.230225769 au
magnitude: 0.585187399 debye
temp: 298.15 k
press: 1.00 atm
zeropoint: 0.44960279 hartree
thermalvibcorrection: 0.02269904 hartree
thermalrotcorrection: 0.00141627 hartree
thermaltrasncorrection: 0.00141627 hartree
thermaltotal: -1322.92951612 hartree
thermalcorr: 0.02553158 hartree
nonthermalcorr: 0.44960279 hartree
totalcorr: 0.47513436 hartree
thermalcorrenthalpy: 0.00094421 hartree
totalenthalpy: -1322.92857191 hartree
vibrat: 0.03972425 hartree
rotat: 0.01705542 hartree
transl: 0.02084687 hartree
total: 0.07866383 hartree
totalentropycorr: -0.07866383 hartree
gibbsenthalpy: -1323.00723574 hartree
gibbsminuselec: 0.39741474 hartree
