program: Orca
programVersion: 6.0.1
charge: 0
multiplicity: 3
keywords: UKS wB97X-D3 def2-TZVP def2/J RIJCOSX CPCM(Toluene) NEB-TS TightSCF Freq
frequency: 0.00 0.00 0.00 0.00 0.00 0.00 -773.59 10.94 37.87 43.25 48.61 54.28 64.36 79.70 83.75 87.68 97.87 113.53 118.17 141.96 150.96 156.90 180.26 202.16 206.82 213.29 231.14 232.12 252.06 277.97 282.10 304.70 319.04 331.01 347.18 374.59 388.07 419.32 424.80 428.43 440.76 455.06 485.89 492.44 520.88 529.52 548.62 594.50 619.87 631.00 635.68 659.15 672.28 702.98 715.41 722.83 743.81 758.34 782.67 787.36 797.64 801.18 822.67 834.89 847.57 852.60 854.06 866.78 889.40 929.30 938.94 951.03 963.50 981.29 989.35 1000.84 1005.90 1007.71 1011.73 1018.45 1021.24 1027.92 1034.37 1052.67 1066.13 1074.79 1090.85 1119.13 1124.90 1149.08 1152.52 1166.70 1176.27 1178.36 1179.56 1196.09 1204.80 1215.46 1219.13 1223.31 1238.83 1249.69 1254.15 1255.62 1269.90 1271.06 1279.89 1294.32 1305.79 1312.02 1323.05 1325.98 1335.15 1343.01 1359.49 1377.07 1391.25 1406.15 1425.21 1443.20 1470.21 1472.16 1476.51 1479.43 1479.87 1482.74 1484.16 1488.80 1490.35 1492.08 1498.07 1503.55 1531.26 1547.39 1594.19 1618.00 1642.22 1664.43 1803.36 1826.12 3057.55 3074.53 3079.44 3080.28 3104.52 3128.28 3131.47 3155.72 3159.51 3161.61 3162.04 3162.59 3163.49 3170.19 3193.53 3194.97 3195.19 3195.82 3200.00 3206.01 3211.58 3216.16 3220.08 3227.18 3260.59
frequency: 10.94 37.87 43.25 48.61 54.28 64.36 79.70 83.75 87.68 97.87 113.53 118.17 141.96 150.96 156.90 180.26 202.16 206.82 213.29 231.14 232.12 252.06 277.97 282.10 304.70 319.04 331.01 347.18 374.59 388.07 419.32 424.80 428.43 440.76 455.06 485.89 492.44 520.88 529.52 548.62 594.50 619.87 631.00 635.68 659.15 672.28 702.98 715.41 722.83 743.81 758.34 782.67 787.36 797.64 801.18 822.67 834.89 847.57 852.60 854.06 866.78 889.40 929.30 938.94 951.03 963.50 981.29 989.35 1000.84 1005.90 1007.71 1011.73 1018.45 1021.24 1027.92 1034.37 1052.67 1066.13 1074.79 1090.85 1119.13 1124.90 1149.08 1152.52 1166.70 1176.27 1178.36 1179.56 1196.09 1204.80 1215.46 1219.13 1223.31 1238.83 1249.69 1254.15 1255.62 1269.90 1271.06 1279.89 1294.32 1305.79 1312.02 1323.05 1325.98 1335.15 1343.01 1359.49 1377.07 1391.25 1406.15 1425.21 1443.20 1470.21 1472.16 1476.51 1479.43 1479.87 1482.74 1484.16 1488.80 1490.35 1492.08 1498.07 1503.55 1531.26 1547.39 1594.19 1618.00 1642.22 1664.43 1803.36 1826.12 3057.55 3074.53 3079.44 3080.28 3104.52 3128.28 3131.47 3155.72 3159.51 3161.61 3162.04 3162.59 3163.49 3170.19 3193.53 3194.97 3195.19 3195.82 3200.00 3206.01 3211.58 3216.16 3220.08 3227.18 3260.59
formula: C25H25NO4
InChI: InChI=1/C25H25NO4/c1-5-16-14-25(23(27)29-3,24(28)30-4)21-20(16)19(17-9-7-6-8-10-17)13-18-12-11-15(2)26-22(18)21/h5-13,16,20-21H,1,14H2,2-4H3
55 atoms
C  1.360797 4.602889 1.701042
C  0.416447 3.600725 1.109816
C  -0.787473 3.992326 0.510344
C  -1.616806 3.037984 -0.014142
C  -1.255463 1.670427 0.052412
C  -2.112208 0.657798 -0.384125
C  -1.712575 -0.678543 -2.994409
C  -1.345181 -1.504393 -1.954178
C  0.030639 -1.52162 -1.298889
C  1.056512 -0.470972 -1.710625
C  1.771643 -0.17022 -0.387125
C  2.681745 1.048355 -0.476139
O  3.581036 1.047816 0.503058
C  4.452288 2.177492 0.560889
O  2.610477 1.89279 -1.328749
C  2.627139 -1.372152 0.02383
O  3.573265 -1.606711 -0.883296
C  4.45458 -2.699004 -0.609907
O  2.471472 -2.040155 1.011408
C  0.582285 -0.017403 0.614295
C  -0.380614 -1.131954 0.136845
C  -1.835411 -0.768052 -0.145845
C  -2.910658 -1.582284 0.441552
C  -4.183943 -1.049512 0.683512
C  -5.205709 -1.831384 1.19803
C  -4.991506 -3.172071 1.480167
C  -3.737268 -3.721105 1.243822
C  -2.715265 -2.941444 0.733824
C  0.015361 1.383402 0.614736
N  0.789482 2.320283 1.139949
H  0.838341 5.503734 2.023523
H  2.108024 4.89831 0.958676
H  1.887686 4.168387 2.550124
H  -1.057966 5.040757 0.478833
H  -2.564694 3.312119 -0.464018
H  -3.030966 0.934352 -0.886214
H  -1.105671 0.162158 -3.305998
H  -2.674055 -0.799244 -3.477721
H  -1.896187 -2.43515 -1.855501
H  0.473872 -2.518859 -1.360994
H  0.583783 0.454392 -2.043042
H  1.73604 -0.797443 -2.495828
H  5.103883 2.004068 1.412492
H  3.870891 3.087566 0.704567
H  5.034473 2.255217 -0.356871
H  3.894284 -3.631847 -0.554748
H  4.980466 -2.534343 0.329966
H  5.155177 -2.725541 -1.439575
H  0.940384 -0.223484 1.622074
H  -0.313566 -1.964433 0.831638
H  -4.376278 -0.003367 0.484237
H  -6.176695 -1.385904 1.380819
H  -5.790825 -3.783738 1.880645
H  -3.553269 -4.767439 1.458015
H  -1.752215 -3.403578 0.552799
totalener: -1323.36696300145650 hartree
nucrepener: 3048.29631046715667 hartree
electener: -4371.64947266359195 hartree
oneelecener: -7863.73027142765568 hartree
twoeener: 3492.08079876406373 hartree
cpcmener: -0.01383157799597 hartree
kineticenergy: 1317.59042745544843 hartree
xcener: -128.502475539110 hartree
s2: 2.090139
dispersion: -0.033803351 hartree
s2: 2.090145
dispersion: -0.033798816 hartree
s2: 2.088093
dispersion: -0.033768605 hartree
s2: 2.090534
dispersion: -0.033795027 hartree
s2: 2.090645
dispersion: -0.033821464 hartree
s2: 2.091062
dispersion: -0.033773082 hartree
s2: 2.090736
dispersion: -0.033871755 hartree
s2: 2.090610
dispersion: -0.033826031 hartree
s2: 2.090625
dispersion: -0.033871630 hartree
s2: 2.090462
dispersion: -0.033881021 hartree
s2: 2.090263
dispersion: -0.033894861 hartree
s2: 2.090033
dispersion: -0.033905604 hartree
s2: 2.089903
dispersion: -0.033914599 hartree
s2: 2.089784
dispersion: -0.033910605 hartree
s2: 2.089703
dispersion: -0.033931367 hartree
s2: 2.089731
dispersion: -0.033924491 hartree
s2: 2.089793
dispersion: -0.033910549 hartree
s2: 2.089836
dispersion: -0.033891956 hartree
s2: 2.089865
dispersion: -0.033899117 hartree
s2: 2.089910
dispersion: -0.033860031 hartree
s2: 2.089812
dispersion: -0.033892379 hartree
s2: 2.089864
dispersion: -0.033895561 hartree
s2: 2.089747
dispersion: -0.033904183 hartree
s2: 2.090414
dispersion: -0.033901939 hartree
s2: 2.089613
dispersion: -0.033948453 hartree
s2: 2.089541
dispersion: -0.033938936 hartree
s2: 2.089557
dispersion: -0.033928009 hartree
s2: 2.089706
dispersion: -0.033898164 hartree
s2: 2.089902
dispersion: -0.033902141 hartree
s2: 2.089766
dispersion: -0.033892215 hartree
s2: 2.089813
dispersion: -0.033899036 hartree
elementType: C O N H
s2: 2.089837
energy: -524.8381 -524.7075 -523.2269 -523.0658 -392.2718 -283.4442 -283.3613 -281.0833 -280.9572 -280.9206 -280.8374 -280.8154 -280.5826 -280.1871 -280.1183 -280.0815 -280.0744 -280.0635 -280.0170 -279.9005 -279.8907 -279.7423 -279.7407 -279.7250 -279.7098 -279.7075 -279.6920 -279.6732 -279.5115 -279.4039 -33.8299 -33.5373 -31.2169 -31.0855 -29.2016 -27.5421 -26.7404 -25.9369 -25.3475 -24.9920 -24.2573 -23.7550 -23.5673 -23.2400 -23.1577 -22.7382 -22.5615 -21.7491 -20.5734 -20.3742 -19.8402 -19.7180 -19.2539 -19.0103 -18.8618 -18.2982 -17.9542 -17.6219 -17.2943 -17.1468 -16.9000 -16.5434 -16.3210 -16.2953 -16.0640 -15.9293 -15.8026 -15.7450 -15.2045 -15.1584 -14.8855 -14.8362 -14.6511 -14.5839 -14.3741 -14.3325 -14.1382 -13.8878 -13.8318 -13.7887 -13.6465 -13.4048 -13.2548 -13.1534 -13.0972 -12.9152 -12.8376 -12.6039 -12.5685 -12.3505 -12.1818 -12.1006 -11.8658 -11.8458 -11.4391 -11.3026 -11.2320 -11.0685 -11.0133 -10.6964 -10.4173 -10.1074 -9.7393 -9.5311 -9.4653 -9.4126 -7.5739 -6.2255 1.0276 1.5426 1.6835 2.0236 2.1779 2.5140 2.9991 3.4038 3.5609 3.7122 3.8402 electronvolt
energy: -524.8377 -524.7074 -523.2266 -523.0662 -392.3241 -283.4441 -283.3612 -281.0832 -280.9572 -280.8440 -280.8103 -280.7594 -280.4286 -280.1882 -280.1354 -280.1153 -280.0834 -280.0537 -279.9043 -279.8810 -279.8356 -279.7805 -279.7411 -279.7348 -279.7199 -279.6865 -279.6638 -279.6458 -279.4087 -279.3564 -33.8290 -33.5370 -31.2162 -31.0860 -29.1444 -27.4123 -26.6878 -25.7304 -25.2225 -24.8876 -24.1114 -23.6274 -23.5179 -23.1493 -23.0518 -22.6531 -22.3531 -21.5689 -20.5195 -20.1120 -19.6756 -19.6329 -19.1537 -18.9236 -18.8190 -18.2005 -17.8976 -17.5553 -17.2003 -17.0847 -16.8392 -16.4829 -16.2692 -16.2465 -15.9795 -15.9109 -15.7788 -15.6941 -15.1254 -15.0828 -14.8263 -14.7391 -14.4986 -14.4500 -14.3002 -14.1839 -14.0563 -13.8197 -13.7615 -13.7146 -13.5507 -13.2887 -13.1384 -13.0451 -12.9849 -12.8820 -12.7706 -12.5642 -12.4512 -12.2994 -12.0982 -12.0351 -11.8057 -11.7288 -11.3325 -11.2685 -11.0586 -11.0187 -10.7054 -10.5347 -10.1028 -10.0507 -9.5675 -9.3137 -9.3034 -8.6896 -0.9705 0.1263 1.3537 1.7375 2.0422 2.1821 2.5281 2.7107 3.0178 3.4097 3.6037 electronvolt
dispersion: -0.033899430 hartree
energy: -1323.401831793114 hartree
dipole: 0.904537862 -0.828383132 0.076154730 1.233953386 -1.169814265 0.064139122 -2.459608013 2.254868093 -0.204739920
dipolemethod: SCF
magnitude: 0.227665994 au
magnitude: 0.578680968 debye
temp: 298.15 k
press: 1.00 atm
zeropoint: 0.44848034 hartree
thermalvibcorrection: 0.02411148 hartree
thermalrotcorrection: 0.00141627 hartree
thermaltrasncorrection: 0.00141627 hartree
thermaltotal: -1322.92640743 hartree
thermalcorr: 0.02694402 hartree
nonthermalcorr: 0.44848034 hartree
totalcorr: 0.47542436 hartree
thermalcorrenthalpy: 0.00094421 hartree
totalenthalpy: -1322.92546322 hartree
vibrat: 0.04306589 hartree
rotat: 0.01705945 hartree
transl: 0.02084687 hartree
total: 0.08200950 hartree
totalentropycorr: -0.08200950 hartree
gibbsenthalpy: -1323.00747273 hartree
gibbsminuselec: 0.39435907 hartree
