program: Orca
programVersion: 6.0.1
elementType: C C C C C C H C C C C C O C O C O C O C C C C C C C C C C N H H H H H H H H C H H H H H H H H H H H H H H H H
charge: 0
multiplicity: 1
keywords: UKS wB97X-D3 def2-TZVP def2/J RIJCOSX CPCM(Toluene) VeryTightOpt VerySlowConv TightSCF Freq KeepDens
frequency: 0.00 0.00 0.00 0.00 0.00 0.00 -7.79 30.65 40.86 47.13 53.90 58.87 73.03 86.23 91.21 100.67 127.49 138.01 171.34 172.44 180.42 190.23 202.59 219.95 226.09 236.38 257.62 277.96 291.78 305.85 320.75 339.23 367.05 375.24 416.33 419.85 432.15 439.60 459.63 494.16 518.62 538.44 547.08 587.76 613.41 629.69 636.08 645.05 666.57 693.31 710.40 726.95 737.39 761.28 780.84 787.43 803.83 816.13 821.55 844.50 858.10 862.61 876.29 878.25 898.93 944.31 947.43 952.33 959.64 990.12 996.27 1001.28 1010.75 1012.38 1025.20 1026.31 1026.98 1035.10 1039.70 1060.86 1062.10 1068.06 1077.83 1096.22 1105.65 1116.47 1121.50 1141.48 1152.88 1161.67 1174.59 1179.51 1182.38 1183.40 1185.70 1205.24 1206.49 1216.11 1220.57 1224.05 1231.79 1235.94 1250.88 1267.23 1271.47 1282.48 1286.53 1304.48 1305.84 1315.42 1318.74 1327.59 1329.46 1342.88 1348.97 1352.81 1360.03 1371.44 1405.90 1414.20 1452.32 1474.27 1477.35 1479.14 1483.11 1484.32 1484.61 1488.49 1491.51 1492.00 1492.34 1507.17 1533.44 1548.67 1651.38 1657.60 1681.85 1683.86 1803.07 1825.96 3063.43 3079.14 3079.47 3092.48 3099.05 3102.97 3116.68 3128.62 3131.06 3134.11 3141.01 3148.05 3161.78 3162.65 3163.67 3165.90 3184.08 3189.02 3191.25 3193.97 3194.11 3200.50 3208.47 3216.62 3219.89
frequency: 30.65 40.86 47.13 53.90 58.87 73.03 86.23 91.21 100.67 127.49 138.01 171.34 172.44 180.42 190.23 202.59 219.95 226.09 236.38 257.62 277.96 291.78 305.85 320.75 339.23 367.05 375.24 416.33 419.85 432.15 439.60 459.63 494.16 518.62 538.44 547.08 587.76 613.41 629.69 636.08 645.05 666.57 693.31 710.40 726.95 737.39 761.28 780.84 787.43 803.83 816.13 821.55 844.50 858.10 862.61 876.29 878.25 898.93 944.31 947.43 952.33 959.64 990.12 996.27 1001.28 1010.75 1012.38 1025.20 1026.31 1026.98 1035.10 1039.70 1060.86 1062.10 1068.06 1077.83 1096.22 1105.65 1116.47 1121.50 1141.48 1152.88 1161.67 1174.59 1179.51 1182.38 1183.40 1185.70 1205.24 1206.49 1216.11 1220.57 1224.05 1231.79 1235.94 1250.88 1267.23 1271.47 1282.48 1286.53 1304.48 1305.84 1315.42 1318.74 1327.59 1329.46 1342.88 1348.97 1352.81 1360.03 1371.44 1405.90 1414.20 1452.32 1474.27 1477.35 1479.14 1483.11 1484.32 1484.61 1488.49 1491.51 1492.00 1492.34 1507.17 1533.44 1548.67 1651.38 1657.60 1681.85 1683.86 1803.07 1825.96 3063.43 3079.14 3079.47 3092.48 3099.05 3102.97 3116.68 3128.62 3131.06 3134.11 3141.01 3148.05 3161.78 3162.65 3163.67 3165.90 3184.08 3189.02 3191.25 3193.97 3194.11 3200.50 3208.47 3216.62 3219.89
formula: C25H25NO4
InChI: InChI=1/C25H25NO4/c1-13-9-10-15-17-11-18-16-12-24(22(27)29-2,23(28)30-3)20(21(15)26-13)19(16)25(17,18)14-7-5-4-6-8-14/h4-10,16-20H,11-12H2,1-3H3
55 atoms
C  0.898147 4.571612 1.186727
C  0.049844 3.453756 0.654259
C  -1.173657 3.697072 0.035793
C  -1.889977 2.627085 -0.454444
C  -1.38888 1.333092 -0.342791
C  -2.171216 0.177154 -0.88253
H  -2.691364 -3.804511 -0.425045
C  -1.419081 -1.695518 -1.750575
C  0.04576 -1.854395 -1.263588
C  1.158536 -0.913911 -1.721127
C  1.750818 -0.390197 -0.400691
C  2.595264 0.863269 -0.598649
O  3.43101 1.045353 0.419384
C  4.218698 2.235435 0.385394
O  2.522884 1.593859 -1.550784
C  2.638822 -1.46454 0.233898
O  3.660067 -1.767018 -0.566913
C  4.588414 -2.731453 -0.064739
O  2.45463 -1.989994 1.299481
C  0.496209 -0.163488 0.505668
C  -0.367091 -1.383456 0.152536
C  -1.839526 -1.224843 -0.319571
C  -2.874954 -1.892509 0.528123
C  -3.520246 -1.185899 1.541566
C  -4.44876 -1.808305 2.361397
C  -4.75054 -3.151397 2.180178
C  -4.11387 -3.864317 1.175587
C  -3.183107 -3.238484 0.358316
C  -0.15804 1.183429 0.288022
N  0.524568 2.220715 0.780678
H  0.300932 5.453895 1.416797
H  1.64561 4.856884 0.44168
H  1.427023 4.249646 2.083226
H  -1.555016 4.70755 -0.044415
H  -2.854638 2.784608 -0.926011
H  -4.939882 -1.243415 3.145259
H  -5.478402 -3.638103 2.81833
H  -4.342861 -4.912769 1.023977
C  -1.836824 -0.330227 -2.316077
H  -1.083337 0.237016 -2.862425
H  0.776629 -0.05367 -2.269965
H  1.910348 -1.389166 -2.348424
H  4.826101 2.213502 1.285746
H  3.569666 3.11071 0.385827
H  4.849862 2.248393 -0.502762
H  4.08887 -3.683903 0.109581
H  5.030788 -2.376957 0.865804
H  5.349068 -2.837053 -0.833074
H  0.813312 -0.190413 1.547224
H  -0.269486 -2.147325 0.921058
H  -3.290628 -0.135964 1.692611
H  -2.728236 -0.397132 -2.938704
H  -3.234392 0.40276 -0.788807
H  0.369094 -2.895093 -1.295158
H  -1.852534 -2.571897 -2.228933
totalener: -1323.46710947301722 hartree
nucrepener: 3077.21152507755869 hartree
electener: -4400.66536355547760 hartree
oneelecener: -7922.13141456503399 hartree
twoeener: 3521.46605100955640 hartree
cpcmener: -0.01327254752942 hartree
kineticenergy: 1317.65117086087275 hartree
xcener: -128.583853026597 hartree
s2: 0.000000
dispersion: -0.033815792 hartree
dispersion: -0.033813382 hartree
s2: -0.000000
dispersion: -0.033813142 hartree
dispersion: -0.033814662 hartree
dispersion: -0.033816144 hartree
dispersion: -0.033816164 hartree
dispersion: -0.033815201 hartree
dispersion: -0.033815946 hartree
elementType: C H O N
energy: -524.7778 -524.6754 -523.1640 -523.0416 -392.1916 -283.3818 -283.3214 -281.0420 -280.9315 -280.7777 -280.7609 -280.7586 -280.0565 -280.0485 -279.9991 -279.9437 -279.8933 -279.8830 -279.7121 -279.7007 -279.6866 -279.6843 -279.6773 -279.6715 -279.6344 -279.6274 -279.6205 -279.6174 -279.5376 -279.3812 -33.7772 -33.4976 -31.1519 -31.0536 -29.1141 -27.8536 -26.6430 -26.2114 -25.2344 -24.8228 -24.1004 -23.8380 -23.4770 -23.1527 -22.9753 -22.7621 -22.0750 -21.3066 -20.6847 -20.3198 -19.6503 -19.4152 -19.0883 -18.8306 -18.7032 -18.5257 -17.8976 -17.6602 -17.3529 -16.9646 -16.6899 -16.4257 -16.2806 -16.1451 -15.9620 -15.8536 -15.7465 -15.6190 -15.1696 -15.0795 -14.8829 -14.8198 -14.6839 -14.4557 -14.1584 -14.1164 -14.0136 -13.8919 -13.6897 -13.6309 -13.4332 -13.3825 -13.1064 -12.9087 -12.8553 -12.6473 -12.6049 -12.5188 -12.4258 -12.1907 -12.0826 -12.0353 -11.8274 -11.6978 -11.4499 -11.2101 -10.9801 -10.7563 -10.6450 -10.2467 -10.0724 -10.0053 -9.7101 -9.4703 -9.3068 -9.0232 -8.6536 1.0658 1.5922 1.7026 1.8682 2.1871 2.5508 2.9773 3.3739 3.4860 3.7178 3.7293 electronvolt
chargesum: -0.0000000
charge: -0.423591 0.191694 -0.177454 -0.208123 -0.054460 -0.273980 0.143793 -0.300044 0.017525 -0.429459 0.373067 0.247085 -0.250540 -0.230206 -0.373263 0.242441 -0.274835 -0.231649 -0.377411 0.195463 -0.272784 0.641365 0.077093 -0.265485 -0.134167 -0.151410 -0.143576 -0.257421 -0.024070 -0.359203 0.138883 0.146548 0.146939 0.147732 0.144896 0.139247 0.140760 0.138280 -0.189337 0.115761 0.147108 0.144157 0.147568 0.132726 0.146346 0.143671 0.145796 0.149049 0.124432 0.129772 0.157555 0.109412 0.128109 0.095216 0.112980
charge: -0.259645 -0.242698 -0.126354 -0.081629 -0.103009 -0.126458 0.152422 -0.126651 -0.155347 -0.161898 -0.162685 -0.447095 0.269439 -0.298865 0.105536 -0.434565 0.260235 -0.298119 0.109663 -0.109361 -0.097290 -0.110131 -0.106553 -0.108249 -0.144839 -0.153013 -0.145343 -0.110227 -0.146575 0.181849 0.129056 0.133788 0.131597 0.152771 0.156821 0.148620 0.147373 0.148342 -0.169935 0.130622 0.149492 0.143940 0.117537 0.114457 0.115473 0.115766 0.117172 0.117260 0.175301 0.159234 0.155682 0.136412 0.163845 0.151049 0.135779
qa: -0.4236 0.1917 -0.1775 -0.2081 -0.0545 -0.2740 0.1438 -0.3000 0.0175 -0.4295 0.3731 0.2471 -0.2505 -0.2302 -0.3733 0.2424 -0.2748 -0.2316 -0.3774 0.1955 -0.2728 0.6414 0.0771 -0.2655 -0.1342 -0.1514 -0.1436 -0.2574 -0.0241 -0.3592 0.1389 0.1465 0.1469 0.1477 0.1449 0.1392 0.1408 0.1383 -0.1893 0.1158 0.1471 0.1442 0.1476 0.1327 0.1463 0.1437 0.1458 0.1490 0.1244 0.1298 0.1576 0.1094 0.1281 0.0952 0.1130
va: 3.8536 3.8390 3.8782 4.0481 3.8301 4.0687 0.9713 4.0694 3.9192 4.1240 3.5230 4.2926 2.1058 3.8823 2.1322 4.2424 2.1297 3.8694 2.1307 4.0106 4.3775 3.1464 3.4852 3.9686 3.8932 3.8833 3.9088 3.9772 3.9332 3.0174 0.9669 0.9613 0.9769 0.9683 0.9715 0.9698 0.9668 0.9697 3.9928 0.9859 0.9770 0.9841 0.9670 0.9651 0.9689 0.9665 0.9671 0.9667 0.9974 0.9647 0.9619 0.9762 0.9539 0.9642 0.9667
dispersion: -0.033815889 hartree
energy: -1323.500925065729 hartree
dipole: 0.746612687 -0.821482181 -0.074869494 2.461897032 -2.389829892 0.072067140 -1.057697067 0.650156403 -0.407540664
dipolemethod: SCF
magnitude: 0.420581153 au
magnitude: 1.069032334 debye
temp: 298.15 k
press: 1.00 atm
zeropoint: 0.45627213 hartree
thermalvibcorrection: 0.02192327 hartree
thermalrotcorrection: 0.00141627 hartree
thermaltrasncorrection: 0.00141627 hartree
thermaltotal: -1323.01989712 hartree
thermalcorr: 0.02475581 hartree
nonthermalcorr: 0.45627213 hartree
totalcorr: 0.48102794 hartree
thermalcorrenthalpy: 0.00094421 hartree
totalenthalpy: -1323.01895291 hartree
vibrat: 0.03837859 hartree
rotat: 0.01702908 hartree
transl: 0.02084687 hartree
total: 0.07625454 hartree
totalentropycorr: -0.07625454 hartree
gibbsenthalpy: -1323.09520745 hartree
gibbsminuselec: 0.40571761 hartree
