program: Orca
programVersion: 6.0.1
elementType: C C C C C C H C C C C C O C O C O C O C C C C C C C C C C N H H H H H H H H C H H H H H H H H H H H H H H H H
charge: 0
multiplicity: 1
keywords: UKS wB97X-D3 def2-QZVPPD DEF2/J RIJCOSX DEFGRID3 CPCM(Toluene) TightSCF
formula: C25H25NO4
InChI: InChI=1/C25H25NO4/c1-13-9-10-15-17-11-18-16-12-24(22(27)29-2,23(28)30-3)20(21(15)26-13)19(16)25(17,18)14-7-5-4-6-8-14/h4-10,16-20H,11-12H2,1-3H3
55 atoms
C  0.898147 4.571612 1.186727
C  0.049844 3.453756 0.654259
C  -1.173657 3.697072 0.035793
C  -1.889977 2.627085 -0.454444
C  -1.38888 1.333092 -0.342791
C  -2.171216 0.177154 -0.88253
H  -2.691364 -3.804511 -0.425045
C  -1.419081 -1.695518 -1.750575
C  0.04576 -1.854395 -1.263588
C  1.158536 -0.913911 -1.721127
C  1.750818 -0.390197 -0.400691
C  2.595264 0.863269 -0.598649
O  3.43101 1.045353 0.419384
C  4.218698 2.235435 0.385394
O  2.522884 1.593859 -1.550784
C  2.638822 -1.46454 0.233898
O  3.660067 -1.767018 -0.566913
C  4.588414 -2.731453 -0.064739
O  2.45463 -1.989994 1.299481
C  0.496209 -0.163488 0.505668
C  -0.367091 -1.383456 0.152536
C  -1.839526 -1.224843 -0.319571
C  -2.874954 -1.892509 0.528123
C  -3.520246 -1.185899 1.541566
C  -4.44876 -1.808305 2.361397
C  -4.75054 -3.151397 2.180178
C  -4.11387 -3.864317 1.175587
C  -3.183107 -3.238484 0.358316
C  -0.15804 1.183429 0.288022
N  0.524568 2.220715 0.780678
H  0.300932 5.453895 1.416797
H  1.64561 4.856884 0.44168
H  1.427023 4.249646 2.083226
H  -1.555016 4.70755 -0.044415
H  -2.854638 2.784608 -0.926011
H  -4.939882 -1.243415 3.145259
H  -5.478402 -3.638103 2.81833
H  -4.342861 -4.912769 1.023977
C  -1.836824 -0.330227 -2.316077
H  -1.083337 0.237016 -2.862425
H  0.776629 -0.05367 -2.269965
H  1.910348 -1.389166 -2.348424
H  4.826101 2.213502 1.285746
H  3.569666 3.11071 0.385827
H  4.849862 2.248393 -0.502762
H  4.08887 -3.683903 0.109581
H  5.030788 -2.376957 0.865804
H  5.349068 -2.837053 -0.833074
H  0.813312 -0.190413 1.547224
H  -0.269486 -2.147325 0.921058
H  -3.290628 -0.135964 1.692611
H  -2.728236 -0.397132 -2.938704
H  -3.234392 0.40276 -0.788807
H  0.369094 -2.895093 -1.295158
H  -1.852534 -2.571897 -2.228933
elementType: C H O N
totalener: -1323.54691747827974 hartree
nucrepener: 3077.19193078762464 hartree
electener: -4400.72568537501502 hartree
oneelecener: -7922.06725828975141 hartree
twoeener: 3521.34157291473639 hartree
cpcmener: -0.01317260446886 hartree
kineticenergy: 1317.71823443051858 hartree
xcener: -128.541768464058 hartree
s2: 0.000000
energy: -524.8112 -524.7085 -523.2115 -523.0899 -392.2449 -283.4554 -283.3973 -281.0996 -280.9904 -280.8590 -280.8422 -280.8363 -280.1282 -280.1224 -280.0652 -280.0216 -279.9737 -279.9527 -279.7874 -279.7656 -279.7641 -279.7628 -279.7442 -279.7388 -279.7042 -279.7026 -279.6974 -279.6952 -279.6012 -279.4440 -33.7823 -33.5032 -31.1609 -31.0639 -29.1202 -27.8557 -26.6492 -26.2152 -25.2400 -24.8283 -24.1033 -23.8437 -23.4843 -23.1554 -22.9781 -22.7655 -22.0788 -21.3108 -20.6887 -20.3248 -19.6558 -19.4210 -19.0934 -18.8375 -18.7075 -18.5310 -17.9035 -17.6654 -17.3558 -16.9693 -16.6954 -16.4308 -16.2871 -16.1502 -15.9685 -15.8643 -15.7554 -15.6268 -15.1726 -15.0834 -14.8867 -14.8245 -14.6880 -14.4599 -14.1616 -14.1195 -14.0169 -13.8957 -13.6948 -13.6359 -13.4374 -13.3869 -13.1127 -12.9140 -12.8582 -12.6523 -12.6109 -12.5257 -12.4294 -12.1949 -12.0876 -12.0405 -11.8317 -11.7015 -11.4552 -11.2237 -10.9923 -10.7597 -10.6564 -10.2523 -10.0826 -10.0149 -9.7145 -9.4824 -9.3139 -9.0298 -8.6601 1.0092 1.3808 1.4988 1.5843 1.6174 1.6454 1.7429 1.8485 1.9145 2.0105 2.1191 electronvolt
chargesum: -0.0000000
charge: -0.346885 -0.627062 0.174724 0.067267 -1.099010 0.462023 0.279717 -0.199297 0.055997 0.348805 0.029784 0.160664 -0.419426 -0.338775 -0.432753 0.017166 -0.513038 -0.431392 -0.473701 1.162536 0.350044 -0.410410 -0.855462 -0.185714 -0.315877 -0.755579 -0.385415 -0.148708 -0.297403 -0.658557 0.128532 0.169682 0.133685 0.550861 0.316492 0.531425 0.764737 0.748618 0.386300 0.019436 -0.050048 0.076814 0.077999 0.179382 0.397949 0.252987 0.231331 0.188894 -0.105376 0.086582 0.266154 0.073995 0.028674 0.343042 -0.012410
charge: 0.352084 -0.319104 0.129765 0.151769 -0.078455 -0.013936 -0.049983 0.036518 0.026358 0.217111 -0.200366 -0.748214 0.275546 0.258406 0.326756 -0.731743 0.273409 0.258157 0.332218 0.032187 0.046668 -0.211148 -0.119492 0.120750 0.085645 0.070225 0.084273 0.119643 -0.209596 0.329794 -0.073033 -0.068252 -0.067573 -0.053693 -0.038649 -0.062493 -0.066176 -0.062908 0.238868 -0.046354 -0.042969 -0.022114 -0.049620 -0.063101 -0.047911 -0.049009 -0.047702 -0.051900 -0.011483 -0.010387 -0.042899 -0.038395 -0.021270 -0.013522 -0.032699
qa: -0.3469 -0.6271 0.1747 0.0673 -1.0990 0.4620 0.2797 -0.1993 0.0560 0.3488 0.0298 0.1607 -0.4194 -0.3388 -0.4328 0.0172 -0.5130 -0.4314 -0.4737 1.1625 0.3500 -0.4104 -0.8555 -0.1857 -0.3159 -0.7556 -0.3854 -0.1487 -0.2974 -0.6586 0.1285 0.1697 0.1337 0.5509 0.3165 0.5314 0.7647 0.7486 0.3863 0.0194 -0.0500 0.0768 0.0780 0.1794 0.3979 0.2530 0.2313 0.1889 -0.1054 0.0866 0.2662 0.0740 0.0287 0.3430 -0.0124
va: 3.9331 4.6905 3.3358 3.5505 3.2534 0.3584 0.8909 3.7235 2.0717 3.4026 2.7708 3.3386 1.8650 3.6496 2.1581 3.3225 1.8996 3.7488 2.0880 -0.2366 2.2745 1.4671 2.9901 3.5886 4.1444 4.4706 4.1063 3.5664 2.5149 2.0636 1.1215 1.0423 1.0194 0.4522 0.7724 0.5283 0.1234 0.1236 3.3091 1.0519 0.9769 1.1621 1.5067 1.4823 1.1630 1.1372 1.1792 1.5065 0.9959 0.7792 0.9556 1.0459 0.9024 0.5304 1.0641
dispersion: -0.033815889 hartree
energy: -1323.580733367397 hartree
dipole: 0.746612687 -0.830076764 -0.083464076 2.461897032 -2.385842221 0.076054811 -1.057697067 0.637354696 -0.420342371
dipolemethod: SCF
magnitude: 0.435245098 au
magnitude: 1.106305119 debye
