program: Orca
programVersion: 6.0.1
elementType: C C C C C C H C C C C C O C O C O C O C C C C C C C C C C N H H H H H H H H C H H H H H H H H H H H H H H H H
charge: 0
multiplicity: 1
keywords: UKS wB97X-D3 def2-QZVPPD DEF2/J RIJCOSX DEFGRID3 CPCM(Toluene) TightSCF
formula: C25H25NO4
InChI: InChI=1/C25H25NO4/c1-13-9-10-15-18-16-11-24(18,14-7-5-4-6-8-14)19-17(16)12-25(22(27)29-2,23(28)30-3)20(19)21(15)26-13/h4-10,16-20H,11-12H2,1-3H3
55 atoms
C  0.494469 3.977986 2.081869
C  -0.16071 3.042213 1.109241
C  -1.181897 3.46173 0.26461
C  -1.754312 2.546735 -0.598718
C  -1.285528 1.242002 -0.632069
C  -1.970376 0.163235 -1.405199
H  -1.210714 -2.288569 1.704267
C  -1.394372 -0.656645 -2.604652
C  -0.047524 -1.189732 -2.116776
C  1.171063 -0.263634 -2.101263
C  1.705935 -0.370488 -0.664544
C  2.600613 0.804685 -0.280462
O  3.243048 0.556708 0.857567
C  4.053704 1.615316 1.369713
O  2.720738 1.817207 -0.916379
C  2.531288 -1.644566 -0.470979
O  3.593908 -1.640928 -1.274871
C  4.476098 -2.760693 -1.162453
O  2.281712 -2.536507 0.29553
C  0.396796 -0.451727 0.175153
C  -0.442003 -1.464488 -0.634635
C  -1.961842 -1.219881 -0.708435
C  -2.800305 -1.482147 0.505319
C  -4.159819 -1.168134 0.495825
C  -4.955711 -1.402074 1.604385
C  -4.406133 -1.956064 2.753459
C  -3.057501 -2.271036 2.778501
C  -2.263088 -2.035047 1.663952
C  -0.237154 0.919732 0.227612
N  0.292545 1.789699 1.082753
H  -0.05969 4.911422 2.175424
H  1.507563 4.213501 1.74731
H  0.572692 3.50811 3.062769
H  -1.533399 4.485242 0.302044
H  -2.579577 2.839082 -1.239765
H  -2.615889 -2.701748 3.669485
H  -6.009284 -1.149809 1.573426
H  -5.027051 -2.13928 3.622256
C  -2.317408 -1.793231 -2.105654
H  0.190261 -2.115567 -2.643861
H  0.897505 0.775188 -2.287626
H  1.923038 -0.535176 -2.839548
H  4.493192 1.231727 2.286053
H  3.434339 2.486755 1.580586
H  4.830168 1.880817 0.653036
H  3.945344 -3.685092 -1.387499
H  4.88999 -2.814501 -0.155952
H  5.264089 -2.587455 -1.889822
H  0.616915 -0.78238 1.189197
H  -0.204731 -2.478842 -0.318291
H  -4.603175 -0.733394 -0.393382
H  -1.45189 -0.272411 -3.621664
H  -2.986756 0.474547 -1.652134
H  -3.367549 -1.638257 -2.353551
H  -2.020216 -2.820566 -2.324353
elementType: C H O N
totalener: -1323.56944789511476 hartree
nucrepener: 3116.48436428228206 hartree
electener: -4440.04019118955694 hartree
oneelecener: -8000.64966705924235 hartree
twoeener: 3560.60947586968541 hartree
cpcmener: -0.01362376808816 hartree
kineticenergy: 1317.73750128742108 hartree
xcener: -128.555389193903 hartree
s2: -0.000000
energy: -524.8501 -524.7244 -523.2469 -523.1114 -392.2629 -283.5005 -283.4057 -281.1240 -280.9966 -280.8391 -280.8369 -280.7945 -280.2367 -280.1388 -280.1215 -280.0333 -280.0149 -279.9879 -279.9597 -279.8144 -279.7757 -279.7668 -279.7574 -279.7308 -279.7169 -279.7031 -279.6934 -279.6874 -279.6764 -279.4148 -33.8066 -33.5245 -31.1992 -31.0805 -29.1612 -28.2432 -26.6572 -26.3727 -25.2134 -24.7859 -24.0584 -23.8800 -23.4623 -23.1760 -22.9288 -22.5886 -22.1642 -21.2991 -20.7043 -20.4322 -19.6447 -19.4531 -19.4028 -19.0091 -18.8226 -18.0535 -17.8610 -17.5131 -17.4423 -17.2286 -16.8481 -16.4839 -16.4085 -16.1935 -15.9654 -15.8712 -15.7840 -15.6807 -15.1057 -15.0067 -14.9148 -14.7354 -14.6268 -14.5492 -14.2884 -14.0544 -13.9922 -13.8003 -13.6863 -13.5170 -13.4807 -13.3644 -13.0233 -12.8615 -12.8362 -12.7421 -12.6106 -12.5113 -12.4420 -12.3293 -12.0314 -11.9104 -11.6257 -11.4098 -11.2751 -11.1536 -11.1339 -11.0531 -10.9452 -10.6710 -10.5599 -10.0631 -9.9957 -9.5017 -9.2959 -8.9954 -8.7192 1.0320 1.3947 1.4688 1.5856 1.6304 1.6971 1.7227 1.8091 1.9643 2.0200 2.0378 electronvolt
chargesum: -0.0000000
charge: -0.270650 -0.749811 -0.008064 -0.010091 -1.018870 0.393816 0.195361 0.210397 0.643942 0.204227 0.840079 0.039617 -0.395684 -0.446291 -0.399599 -0.126387 -0.510031 -0.393117 -0.485383 0.672375 -0.164982 -0.912425 -0.221730 -0.291479 -0.370619 -0.850762 -0.240596 -0.330211 0.245739 -0.537605 -0.019054 0.061123 0.209387 0.505202 0.452234 0.578412 0.573196 0.812332 0.576881 0.091642 0.069836 -0.004294 0.148068 0.235741 0.370423 0.252461 0.238204 0.173167 -0.121084 0.024440 0.311146 0.072249 -0.201115 -0.117487 -0.004274
charge: 0.354414 -0.317187 0.131053 0.159174 -0.069552 -0.000524 -0.053173 0.034921 -0.006051 0.225403 -0.205279 -0.748235 0.277709 0.259523 0.328957 -0.727050 0.276072 0.259186 0.331303 0.018262 0.007300 -0.237535 -0.100043 0.117722 0.085532 0.072437 0.090869 0.127478 -0.224520 0.339397 -0.073817 -0.071773 -0.065756 -0.054961 -0.040082 -0.061194 -0.062748 -0.065308 0.233874 -0.012381 -0.023516 -0.022474 -0.050217 -0.060628 -0.048362 -0.049212 -0.047542 -0.051850 -0.010213 -0.017697 -0.049888 -0.021419 -0.018309 -0.035125 -0.026966
qa: -0.2706 -0.7498 -0.0081 -0.0101 -1.0189 0.3938 0.1954 0.2104 0.6439 0.2042 0.8401 0.0396 -0.3957 -0.4463 -0.3996 -0.1264 -0.5100 -0.3931 -0.4854 0.6724 -0.1650 -0.9124 -0.2217 -0.2915 -0.3706 -0.8508 -0.2406 -0.3302 0.2457 -0.5376 -0.0191 0.0611 0.2094 0.5052 0.4522 0.5784 0.5732 0.8123 0.5769 0.0916 0.0698 -0.0043 0.1481 0.2357 0.3704 0.2525 0.2382 0.1732 -0.1211 0.0244 0.3111 0.0722 -0.2011 -0.1175 -0.0043
va: 3.9953 4.9576 3.6894 3.6897 3.3663 2.6753 0.9738 3.8029 1.4802 3.3982 1.1382 3.1025 1.8925 3.5226 2.1392 3.7827 1.8507 3.7240 2.0712 0.6013 0.8510 3.4546 3.0089 3.7305 4.1167 4.6588 3.9240 3.6824 1.8975 2.0183 1.2402 1.1145 0.9515 0.5350 0.6444 0.5048 0.5389 -0.0176 3.2846 0.7908 0.9075 1.0962 1.5367 1.5633 1.1873 1.1221 1.1592 1.5110 0.9536 0.9198 0.8434 0.8447 1.2422 1.2682 1.0596
dispersion: -0.034105528 hartree
energy: -1323.603553422878 hartree
dipole: -0.196897972 0.071736579 -0.125161394 1.550487221 -1.447397012 0.103090209 0.797270478 -1.328228432 -0.530957954
dipolemethod: SCF
magnitude: 0.555166024 au
magnitude: 1.411119889 debye
