program: Orca
programVersion: 6.0.1
elementType: C C C C C C H C C C C C O C O C O C O C C C C C C C C C C N H H H H H H H H C H H H H H H H H H H H H H H H H
formula: C25H25NO4
InChI: InChI=1/C25H25NO4/c1-13-10-11-16-18-14(2)17-12-25(23(27)29-3,24(28)30-4)21(22(16)26-13)20(17)19(18)15-8-6-5-7-9-15/h5-11,14,17-18,20-21H,2,12H2,1,3-4H3
55 atoms
C  0.830822 4.348033 1.684925
C  0.05776 3.325972 0.89849
C  -1.063651 3.672268 0.138251
C  -1.721304 2.680884 -0.581013
C  -1.246671 1.370953 -0.547402
C  -1.962138 0.221317 -1.225373
H  -1.306402 -2.891351 1.52442
C  -1.330207 -0.421955 -2.485499
C  -0.020742 -1.065713 -1.972986
C  1.258372 -0.21086 -2.027984
C  1.821373 -0.24712 -0.596927
C  2.741652 0.933898 -0.293143
O  3.380322 0.74132 0.858192
C  4.198715 1.806147 1.323332
O  2.886582 1.901593 -0.992856
C  2.634671 -1.518138 -0.344855
O  3.706886 -1.550641 -1.134502
C  4.583601 -2.661235 -0.979736
O  2.368736 -2.384528 0.44795
C  0.530212 -0.260097 0.264946
C  -0.347307 -1.316277 -0.46837
C  -1.809082 -0.996842 -0.347745
C  -2.68467 -1.423235 0.701904
C  -3.974682 -0.857681 0.863457
C  -4.825019 -1.288521 1.873131
C  -4.423877 -2.295505 2.756467
C  -3.154133 -2.864718 2.617821
C  -2.296567 -2.438723 1.612343
C  -0.107294 1.120069 0.234778
N  0.505996 2.06876 0.939395
H  0.289229 5.300058 1.764452
H  1.796702 4.541352 1.191511
H  1.045917 3.969117 2.69422
H  -1.418396 4.705157 0.120605
H  -2.612885 2.921807 -1.167738
H  -2.829304 -3.648197 3.307493
H  -5.813773 -0.833649 1.976194
H  -5.095836 -2.631831 3.549838
C  -2.293994 -1.531289 -2.760098
H  0.145513 -2.020031 -2.493671
H  1.040603 0.837107 -2.280969
H  1.987398 -0.572048 -2.765133
H  4.680094 1.443962 2.237964
H  3.576822 2.684539 1.5458
H  4.954242 2.074309 0.572048
H  4.051425 -3.603438 -1.170924
H  4.998169 -2.683634 0.037868
H  5.384619 -2.521232 -1.713257
H  0.751156 -0.537014 1.305182
H  -0.06784 -2.319363 -0.126545
H  -4.305373 -0.06916 0.183786
H  -1.162403 0.272382 -3.332384
H  -3.00109 0.512699 -1.434251
H  -3.370615 -1.33945 -2.729992
H  -1.962335 -2.450228 -3.253407
elementType: C H O N
totalener: -1323.46988747598903 hartree
nucrepener: 3077.52282201413300 hartree
electener: -4400.97896234993641 hartree
oneelecener: -7922.42591835482926 hartree
twoeener: 3521.44695600489331 hartree
cpcmener: -0.01375087537569 hartree
kineticenergy: 1317.13844636562862 hartree
xcener: -128.392085748057 hartree
s2: 2.053021
energy: -524.8883 -524.7404 -523.2851 -523.1273 -392.3525 -283.5564 -283.4574 -281.2080 -281.0675 -280.9601 -280.9556 -280.8983 -280.3418 -280.2865 -280.2291 -280.2018 -280.1513 -280.1419 -280.1275 -279.9664 -279.9423 -279.9277 -279.8570 -279.8449 -279.8323 -279.8199 -279.8131 -279.7981 -279.7848 -279.5493 -33.8540 -33.5554 -31.2310 -31.1003 -29.1655 -27.7905 -26.5951 -26.1660 -25.0942 -24.8224 -24.2407 -23.9392 -23.4516 -23.1830 -23.0356 -22.5293 -22.2885 -21.6992 -20.4913 -20.4327 -19.6738 -19.5947 -19.3462 -19.0448 -18.8241 -18.0788 -17.9722 -17.6055 -17.5132 -17.1578 -16.9427 -16.4363 -16.4082 -16.2101 -15.9741 -15.8541 -15.7638 -15.6589 -15.1595 -15.0825 -14.9620 -14.7162 -14.6373 -14.4543 -14.3519 -14.1419 -14.0584 -13.8074 -13.7547 -13.6532 -13.5180 -13.3560 -13.0665 -12.9464 -12.8882 -12.8365 -12.7962 -12.6398 -12.4445 -12.3973 -12.1099 -11.9522 -11.8303 -11.6458 -11.4476 -11.4173 -11.2613 -11.0816 -11.0195 -10.6586 -10.3620 -10.0906 -10.0349 -9.5740 -9.4827 -8.9565 -8.4952 -6.5152 1.0149 1.3817 1.4292 1.5733 1.6113 1.6629 1.7673 1.9147 1.9667 2.0390 2.0622 electronvolt
energy: -524.8883 -524.7401 -523.2851 -523.1266 -392.3530 -283.5564 -283.4563 -281.2080 -281.0675 -280.9582 -280.9561 -280.8981 -280.3221 -280.2835 -280.2169 -280.2036 -280.1803 -280.1525 -279.9826 -279.9314 -279.9304 -279.9275 -279.8494 -279.8322 -279.8309 -279.7793 -279.7539 -279.7286 -279.5814 -279.5494 -33.8535 -33.5546 -31.2308 -31.0987 -29.1532 -27.6180 -26.5056 -26.0584 -25.0240 -24.7788 -24.0325 -23.8593 -23.3696 -23.1647 -22.9753 -22.4927 -21.9716 -21.5283 -20.4068 -20.0738 -19.5858 -19.3609 -19.2641 -18.9179 -18.8142 -18.0259 -17.9141 -17.5237 -17.4228 -17.0894 -16.9021 -16.4001 -16.3222 -16.1456 -15.9453 -15.8377 -15.7499 -15.5004 -15.0344 -15.0079 -14.9084 -14.6924 -14.5526 -14.4138 -14.2320 -14.0427 -14.0229 -13.7430 -13.7177 -13.5674 -13.4816 -13.2717 -12.9272 -12.8695 -12.8401 -12.7276 -12.7174 -12.5835 -12.3914 -12.2588 -12.0770 -11.8522 -11.7154 -11.5704 -11.4014 -11.2963 -11.2090 -11.0267 -10.9862 -10.6323 -10.1442 -10.0746 -9.5728 -9.4771 -9.2023 -8.8633 -0.7491 0.7294 1.2032 1.3998 1.4779 1.5857 1.6531 1.7847 1.8265 1.9781 1.9982 electronvolt
chargesum: -0.0000000
charge: -0.427479 -0.725414 0.039847 -0.081349 -1.318613 1.047145 0.305927 0.218722 0.367252 0.359939 0.303499 -0.080287 -0.366848 -0.354621 -0.412925 -0.129873 -0.515294 -0.414591 -0.491197 0.912988 0.187928 -0.928475 -0.375367 -0.273901 -0.310500 -0.734762 -0.208814 -0.384051 -0.027233 -0.543805 0.027153 0.228450 0.265266 0.693481 0.411430 0.591242 0.644882 0.771331 -0.158890 0.082370 0.030463 0.077707 0.179183 0.129002 0.378856 0.260336 0.242869 0.193426 -0.043765 0.031033 0.276593 0.080506 -0.082149 -0.041690 0.093069
charge: 0.342585 -0.316316 0.129523 0.155468 -0.063040 -0.068771 -0.049715 -0.093596 -0.012100 0.218520 -0.213269 -0.749290 0.273443 0.242731 0.324495 -0.725222 0.272906 0.242378 0.327315 0.028668 -0.008756 -0.064904 -0.138249 0.119442 0.072785 0.066706 0.074687 0.124094 -0.214330 0.332217 -0.068672 -0.064698 -0.060809 -0.049103 -0.034210 -0.056495 -0.057182 -0.062826 0.421144 -0.015155 -0.019322 -0.014944 -0.044426 -0.055842 -0.043119 -0.043262 -0.041366 -0.045931 0.007922 -0.020474 -0.051777 -0.002310 -0.022487 -0.089718 -0.095347
qa: -0.4275 -0.7254 0.0398 -0.0813 -1.3186 1.0471 0.3059 0.2187 0.3673 0.3599 0.3035 -0.0803 -0.3668 -0.3546 -0.4129 -0.1299 -0.5153 -0.4146 -0.4912 0.9130 0.1879 -0.9285 -0.3754 -0.2739 -0.3105 -0.7348 -0.2088 -0.3841 -0.0272 -0.5438 0.0272 0.2284 0.2653 0.6935 0.4114 0.5912 0.6449 0.7713 -0.1589 0.0824 0.0305 0.0777 0.1792 0.1290 0.3789 0.2603 0.2429 0.1934 -0.0438 0.0310 0.2766 0.0805 -0.0821 -0.0417 0.0931
va: 3.9669 5.0097 3.4708 3.6081 3.6000 1.0395 0.9315 3.0947 1.7406 3.1899 2.5518 3.4099 1.8865 3.6622 2.1382 3.8758 1.9295 3.7666 2.0542 1.0909 1.3291 3.3124 3.4074 3.4176 4.0981 4.5176 4.0330 3.6169 1.7164 2.0942 1.1787 0.9861 0.9269 0.2684 0.7616 0.4035 0.3411 0.1538 3.9108 0.7400 0.9410 1.0368 1.3682 1.5640 1.1417 1.0901 1.1562 1.4479 1.0162 0.8489 0.9818 0.8416 0.9306 1.2751 1.0894
dispersion: -0.033797310 hartree
energy: -1323.503684786374 hartree
dipole: 0.030378545 0.045250427 0.075628972 1.855619569 -1.543790719 0.311828850 -0.647050927 0.167343161 -0.479707766
dipolemethod: SCF
magnitude: 0.577127814 au
magnitude: 1.466942324 debye
