program: Orca
programVersion: 6.0.1
elementType: C C C C C C C C C C C C O C O C O C O C C C C C C C C C C N H H H H H H H H H H H H H H H H H H H H H H H H H
charge: 0
multiplicity: 1
keywords: UKS wB97X-D3 def2-QZVPPD DEF2/J RIJCOSX DEFGRID3 CPCM(Toluene) TightSCF
formula: C25H25NO4
InChI: InChI=1/C25H25NO4/c1-16-12-13-19-18-11-7-8-14-25(23(27)29-2,24(28)30-3)21(22(19)26-16)15-20(18)17-9-5-4-6-10-17/h4-10,12-13,15,18,21H,11,14H2,1-3H3
55 atoms
C  1.318243 5.0452 0.626111
C  0.395647 3.898368 0.336239
C  -0.840676 4.080658 -0.273624
C  -1.640341 2.978505 -0.509969
C  -1.198789 1.713158 -0.150417
C  -2.048713 0.489691 -0.384581
C  -2.00819 -0.022007 -1.874579
C  -1.152906 -1.233801 -2.132336
C  0.167452 -1.31594 -2.022862
C  1.101492 -0.187856 -1.70517
C  1.665173 -0.15965 -0.266961
C  2.830143 0.850545 -0.245459
O  3.477671 0.80599 0.914873
C  4.519737 1.768486 1.088847
O  3.133679 1.571082 -1.156746
C  2.28556 -1.509275 0.104232
O  3.137435 -1.90778 -0.840685
C  3.810832 -3.146404 -0.600192
O  2.070961 -2.134115 1.107622
C  0.622697 0.281691 0.821185
C  -0.475418 -0.712051 1.084631
C  -1.70002 -0.614099 0.577122
C  -2.723312 -1.658722 0.83169
C  -4.053255 -1.327173 1.090474
C  -4.99649 -2.311767 1.33998
C  -4.630062 -3.650003 1.325005
C  -3.312925 -3.994509 1.058852
C  -2.370496 -3.008341 0.812192
C  0.052708 1.627569 0.447139
N  0.819244 2.687059 0.690827
H  0.905813 5.990815 0.275745
H  2.280315 4.880022 0.137489
H  1.502966 5.119179 1.699337
H  -1.168907 5.074385 -0.551654
H  -2.613662 3.099346 -0.974972
H  -3.082183 0.796313 -0.211374
H  -1.691055 0.813023 -2.504565
H  -3.029699 -0.260981 -2.170723
H  -1.690184 -2.143821 -2.381886
H  0.63345 -2.281486 -2.20245
H  0.624686 0.774875 -1.892968
H  1.953116 -0.240658 -2.382899
H  4.924533 1.589228 2.080763
H  4.105615 2.774292 1.021017
H  5.290451 1.63584 0.330323
H  3.088448 -3.957292 -0.512125
H  4.400001 -3.084819 0.314159
H  4.455727 -3.302129 -1.460181
H  1.193208 0.408534 1.742039
H  -0.229967 -1.53211 1.745973
H  -4.354523 -0.286317 1.119271
H  -6.021993 -2.032467 1.551445
H  -5.368622 -4.419596 1.515319
H  -3.017727 -5.036967 1.035488
H  -1.346829 -3.281687 0.583975
elementType: C O N H
totalener: -1323.55099704356962 hartree
nucrepener: 3056.24426509578007 hartree
electener: -4379.78213416125254 hartree
oneelecener: -7879.91580059470471 hartree
twoeener: 3500.13366643345171 hartree
cpcmener: -0.01313438973305 hartree
kineticenergy: 1317.74490412775094 hartree
xcener: -128.477508995551 hartree
s2: 0.000000
energy: -524.8827 -524.7659 -523.2714 -523.1428 -392.3240 -283.5505 -283.4530 -281.1387 -281.0930 -281.0215 -280.8911 -280.8371 -280.2758 -280.2482 -280.1870 -280.0988 -280.0556 -279.9208 -279.8468 -279.8395 -279.8341 -279.8187 -279.8029 -279.7914 -279.7722 -279.7502 -279.6237 -279.5942 -279.5413 -279.4462 -33.8431 -33.5807 -31.2382 -31.1205 -29.1945 -27.0507 -26.5724 -25.9443 -25.1681 -24.9240 -24.5097 -23.6548 -23.5128 -23.4836 -23.1636 -22.5767 -22.2379 -22.0105 -20.5542 -20.1678 -20.0146 -19.7051 -19.2886 -18.9799 -18.8800 -18.2032 -17.8510 -17.3453 -17.2516 -16.7920 -16.7127 -16.5011 -16.4419 -16.1182 -15.9997 -15.9376 -15.8243 -15.6601 -15.2223 -15.1152 -14.8862 -14.7244 -14.6891 -14.5638 -14.2969 -14.2237 -14.0237 -13.9293 -13.8664 -13.7073 -13.6368 -13.4617 -13.0993 -13.0214 -12.9466 -12.8741 -12.8512 -12.6822 -12.6024 -12.4682 -12.3753 -12.0821 -11.9013 -11.7357 -11.6317 -11.2361 -11.1143 -11.0734 -10.7757 -10.1640 -10.1196 -10.0478 -9.5818 -9.4019 -9.2249 -8.9147 -8.4703 0.9260 1.1859 1.3738 1.5175 1.5454 1.5919 1.7402 1.8398 1.8693 1.9578 1.9842 electronvolt
chargesum: -0.0000000
charge: -0.343284 -0.616424 0.150211 -0.212687 -0.847194 0.754199 -0.011249 0.101414 -0.511467 0.195768 0.824768 -0.124405 -0.444139 -0.288211 -0.396515 0.138297 -0.509817 -0.131697 -0.500568 1.407110 -0.497037 -0.833897 -0.543729 -0.180209 -0.345749 -0.773813 -0.168546 -0.330342 0.027390 -0.591026 -0.007088 0.149665 0.209977 0.533088 0.383524 0.011483 0.026700 0.060580 0.266507 0.162429 0.050474 -0.006029 0.087487 0.259615 0.256731 0.312314 0.198481 0.041901 -0.048837 0.010007 0.279986 0.761795 0.645210 0.796470 0.160379
charge: 0.355777 -0.315404 0.132561 0.150868 -0.096665 -0.047853 0.176326 0.098586 0.114483 0.159668 -0.192371 -0.755499 0.269948 0.261063 0.325277 -0.738863 0.270916 0.261161 0.329555 -0.012764 0.171024 -0.120025 -0.138879 0.115353 0.085390 0.073864 0.089374 0.111562 -0.239504 0.340790 -0.074284 -0.069645 -0.065357 -0.055021 -0.035681 -0.037355 -0.038795 -0.041087 -0.058900 -0.051132 -0.028344 -0.030265 -0.050547 -0.055438 -0.048961 -0.048504 -0.047506 -0.051012 -0.011950 -0.047609 -0.051644 -0.062337 -0.064930 -0.061501 -0.047913
qa: -0.3433 -0.6164 0.1502 -0.2127 -0.8472 0.7542 -0.0112 0.1014 -0.5115 0.1958 0.8248 -0.1244 -0.4441 -0.2882 -0.3965 0.1383 -0.5098 -0.1317 -0.5006 1.4071 -0.4970 -0.8339 -0.5437 -0.1802 -0.3457 -0.7738 -0.1685 -0.3303 0.0274 -0.5910 -0.0071 0.1497 0.2100 0.5331 0.3835 0.0115 0.0267 0.0606 0.2665 0.1624 0.0505 -0.0060 0.0875 0.2596 0.2567 0.3123 0.1985 0.0419 -0.0488 0.0100 0.2800 0.7618 0.6452 0.7965 0.1604
va: 3.8266 4.8682 3.4090 3.8847 1.9804 0.7945 3.5452 3.3533 3.4759 3.3160 2.7334 3.1193 1.9463 3.7162 2.1523 3.6102 1.9331 3.5202 2.1216 0.2247 3.0590 2.4575 3.6596 3.6242 4.1922 4.5081 3.8826 3.7183 1.1989 2.2713 1.3706 1.0126 1.0654 0.5985 0.6515 0.9696 1.0251 1.0320 0.7852 0.9105 0.9177 1.0329 1.5077 1.2536 1.2784 1.1125 1.3118 1.5383 0.8694 1.0053 0.9828 0.1107 0.3700 0.0756 1.0210
dispersion: -0.034902372 hartree
energy: -1323.585899415962 hartree
dipole: 0.089416168 -0.437251062 -0.347834894 1.794960284 -1.674109941 0.120850343 -3.388739056 3.010524190 -0.378214866
dipolemethod: SCF
magnitude: 0.527864001 au
magnitude: 1.341723662 debye
