program: Orca
programVersion: 6.0.1
elementType: C C C C C C C C C C C C O C O C O C O C C C C C C C C C C N H H H H H H H H H H H H H H H H H H H H C H H H H F F F
charge: 0
multiplicity: 1
keywords: UKS wB97X-D3 def2-QZVPPD DEF2/J RIJCOSX DEFGRID3 CPCM(Toluene) TightSCF
formula: C26H24F3NO4
InChI: InChI=1/C26H24F3NO4/c1-15-11-12-18-16-8-6-7-13-25(23(31)33-2,24(32)34-3)21(22(18)30-15)14-19(16)17-9-4-5-10-20(17)26(27,28)29/h4-7,9-12,14,16,21H,8,13H2,1-3H3
58 atoms
C  1.322681 5.001266 0.675134
C  0.388185 3.863635 0.387341
C  -0.854518 4.060009 -0.204861
C  -1.665506 2.966082 -0.440552
C  -1.227303 1.695051 -0.098378
C  -2.092218 0.480811 -0.32595
C  -2.064151 -0.039908 -1.812798
C  -1.206599 -1.244296 -2.094143
C  0.11512 -1.328013 -2.006208
C  1.055427 -0.206748 -1.685369
C  1.625966 -0.197934 -0.25031
C  2.8004 0.801562 -0.223179
O  3.446733 0.743913 0.937028
C  4.497026 1.696284 1.118065
O  3.11123 1.523177 -1.130952
C  2.235429 -1.557197 0.102346
O  3.091656 -1.944312 -0.84315
C  3.758459 -3.18954 -0.618794
O  2.008138 -2.198458 1.09253
C  0.592781 0.242108 0.844803
C  -0.51313 -0.740401 1.122154
C  -1.748662 -0.610039 0.654317
C  -2.777195 -1.641688 0.966207
C  -4.003942 -1.386012 1.595096
C  -4.90885 -2.416248 1.822911
C  -4.615245 -3.714583 1.445259
C  -3.397923 -3.987564 0.845039
C  -2.498063 -2.961658 0.610951
C  0.029603 1.595173 0.484309
N  0.807343 2.646376 0.726931
H  0.911517 5.953054 0.340459
H  2.276329 4.834737 0.170695
H  1.523543 5.062795 1.746224
H  -1.179579 5.058704 -0.468264
H  -2.645227 3.097432 -0.888651
H  -3.119986 0.802853 -0.163494
H  -1.765931 0.798525 -2.447683
H  -3.088915 -0.285901 -2.091809
H  -1.745152 -2.149737 -2.357478
H  0.577538 -2.290507 -2.210285
H  0.581304 0.759682 -1.860392
H  1.902483 -0.256866 -2.368857
H  4.899002 1.507202 2.109288
H  4.09151 2.705955 1.056245
H  5.267341 1.561672 0.359509
H  3.032559 -3.998952 -0.5480
H  4.342605 -3.144853 0.29976
H  4.407856 -3.333849 -1.47738
H  1.169075 0.359179 1.763509
H  -0.270799 -1.563453 1.781239
C  -4.416798 -0.011359 2.063462
H  -5.847876 -2.201199 2.315762
H  -5.331113 -4.505628 1.63005
H  -3.145427 -5.000639 0.555856
H  -1.549828 -3.171497 0.132431
F  -3.385649 0.763578 2.42004
F  -5.096677 0.661519 1.107453
F  -5.234978 -0.070403 3.125945
elementType: C O N H F
totalener: -1660.67629524267454 hartree
nucrepener: 3861.73526789165271 hartree
electener: -5522.39846233872140 hartree
oneelecener: -9957.04645700825313 hartree
twoeener: 4434.64799466953173 hartree
cpcmener: -0.01310565926117 hartree
kineticenergy: 1653.86153196668056 hartree
xcener: -154.531581509384 hartree
s2: 0.000000
energy: -675.3996 -675.3782 -675.3265 -524.9161 -524.7831 -523.3084 -523.1610 -392.3216 -286.7308 -283.5860 -283.4737 -281.1690 -281.1278 -281.0323 -280.8828 -280.8412 -280.7106 -280.6678 -280.3215 -280.2913 -280.2798 -280.1725 -280.1527 -280.0959 -280.0821 -280.0584 -280.0581 -279.8937 -279.8704 -279.8252 -279.6875 -279.6627 -279.6605 -279.4351 -39.1471 -36.6705 -36.5692 -33.8737 -33.6032 -31.2737 -31.1415 -29.1964 -27.4468 -26.7890 -26.0187 -25.2314 -24.9829 -24.7464 -24.5954 -23.7354 -23.6322 -23.2056 -22.6368 -22.5484 -22.1651 -22.0179 -20.6063 -20.3525 -20.3263 -19.9853 -19.7286 -19.4367 -19.1416 -18.9274 -18.9091 -18.4390 -18.1552 -17.8822 -17.3465 -17.0300 -16.8273 -16.7446 -16.5400 -16.3894 -16.1293 -16.0006 -15.9622 -15.9369 -15.8617 -15.8357 -15.6776 -15.5498 -15.2696 -14.9377 -14.8859 -14.8180 -14.6789 -14.5923 -14.4048 -14.2840 -14.1180 -14.1094 -13.9997 -13.9504 -13.8308 -13.7812 -13.6461 -13.5263 -13.2931 -13.0700 -12.9924 -12.9820 -12.8694 -12.7259 -12.6358 -12.6205 -12.4190 -12.2609 -12.1902 -11.8681 -11.6807 -11.3001 -11.2022 -11.0972 -10.8090 -10.1516 -10.1437 -10.0328 -9.7971 -9.5969 -9.3314 -8.9248 -8.8681 0.7821 1.0509 1.2453 1.3486 1.5208 1.5412 1.6809 1.7992 1.8331 1.8744 1.9542 electronvolt
chargesum: 0.0000000
charge: -0.376277 -0.597400 0.067598 -0.142595 -0.682022 0.810070 -0.067727 0.021720 -0.543484 0.349331 0.563524 0.016584 -0.440441 -0.272662 -0.400814 0.114417 -0.522128 -0.114368 -0.496066 1.441319 -0.076716 -1.169151 0.282369 -0.461848 -0.066069 -0.952758 -0.252788 -0.292749 0.046216 -0.562390 0.030089 0.166050 0.200938 0.515054 0.252628 -0.010432 0.023514 0.051553 0.202350 0.180761 0.021839 -0.011684 0.168818 0.155717 0.267853 0.291459 0.197127 0.047997 -0.081968 0.044428 0.784952 0.510807 0.826402 0.748820 0.213126 -0.305949 -0.355615 -0.359332
charge: 0.356046 -0.313773 0.135198 0.155288 -0.097710 -0.043020 0.182673 0.094103 0.113105 0.160529 -0.192694 -0.755693 0.269984 0.261601 0.325929 -0.738886 0.271308 0.261519 0.330424 -0.008338 0.177974 -0.123374 -0.086115 -0.066651 0.129260 0.104422 0.112038 0.129635 -0.238250 0.342239 -0.074188 -0.069542 -0.065255 -0.054501 -0.033276 -0.046857 -0.036517 -0.039109 -0.060694 -0.050524 -0.027342 -0.030026 -0.050474 -0.055218 -0.048941 -0.048666 -0.047313 -0.050897 -0.010801 -0.039356 -1.112175 -0.045183 -0.057260 -0.054771 -0.045434 0.352816 0.323091 0.329643
qa: -0.3763 -0.5974 0.0676 -0.1426 -0.6820 0.8101 -0.0677 0.0217 -0.5435 0.3493 0.5635 0.0166 -0.4404 -0.2727 -0.4008 0.1144 -0.5221 -0.1144 -0.4961 1.4413 -0.0767 -1.1692 0.2824 -0.4618 -0.0661 -0.9528 -0.2528 -0.2927 0.0462 -0.5624 0.0301 0.1661 0.2009 0.5151 0.2526 -0.0104 0.0235 0.0516 0.2024 0.1808 0.0218 -0.0117 0.1688 0.1557 0.2679 0.2915 0.1971 0.0480 -0.0820 0.0444 0.7850 0.5108 0.8264 0.7488 0.2131 -0.3059 -0.3556 -0.3593
va: 4.0517 4.7176 3.4263 3.7547 2.5509 1.8545 3.6981 3.4168 3.5998 2.9423 3.2732 3.1872 1.8848 3.7300 2.1244 3.5467 1.9261 3.5369 2.1058 0.1703 3.2892 2.9382 1.8841 2.4521 3.7841 4.6485 3.7707 3.8238 1.9588 2.2041 1.2481 0.9637 1.0295 0.6484 0.7785 0.9837 1.0473 0.9734 0.8866 0.8735 0.9272 1.0728 1.3609 1.4218 1.2517 1.1325 1.2972 1.5133 0.9321 1.0003 3.2242 0.7938 0.0550 0.3185 0.9458 0.9245 0.9370 0.9390
dispersion: -0.038767672 hartree
energy: -1660.715062914868 hartree
dipole: 30.136133249 -30.058177366 0.077955883 -0.681153087 -0.181368330 -0.862521418 -16.792209322 16.094096863 -0.698112459
dipolemethod: SCF
magnitude: 1.112376429 au
magnitude: 2.827436184 debye
