program: Orca
programVersion: 6.0.1
elementType: C C C C C C C C C C C C O C O C O C O C C C C C C C C C C N H H H H H H H H H H H H H H H H H H H H C H C H H F F F F F F
charge: 0
multiplicity: 1
keywords: UKS wB97X-D3 def2-QZVPPD DEF2/J RIJCOSX DEFGRID3 CPCM(Toluene) TightSCF
formula: C27H23F6NO4
InChI: InChI=1/C27H23F6NO4/c1-14-7-9-18-16-6-4-5-11-25(23(35)37-2,24(36)38-3)21(22(18)34-14)13-19(16)17-10-8-15(26(28,29)30)12-20(17)27(31,32)33/h4-5,7-10,12-13,16,21H,6,11H2,1-3H3
61 atoms
C  1.32682 5.001381 0.670174
C  0.390332 3.864722 0.385765
C  -0.853066 4.06183 -0.2051
C  -1.665798 2.968865 -0.438308
C  -1.228497 1.697751 -0.094964
C  -2.095196 0.484428 -0.321536
C  -2.069418 -0.037509 -1.808113
C  -1.213805 -1.243455 -2.089133
C  0.107925 -1.328638 -2.001889
C  1.049742 -0.207887 -1.683403
C  1.622656 -0.198675 -0.249286
C  2.79847 0.799401 -0.224321
O  3.445786 0.741064 0.934991
C  4.499212 1.690754 1.114121
O  3.108609 1.519702 -1.133203
C  2.229822 -1.559355 0.102079
O  3.092801 -1.941721 -0.838316
C  3.758925 -3.187923 -0.615258
O  1.993379 -2.205404 1.087191
C  0.592062 0.244009 0.847159
C  -0.513214 -0.738201 1.125275
C  -1.748765 -0.605645 0.658356
C  -2.773354 -1.639355 0.971632
C  -4.00269 -1.387146 1.593758
C  -4.907635 -2.416551 1.816765
C  -4.603935 -3.709866 1.436723
C  -3.380459 -3.986883 0.84775
C  -2.486096 -2.959761 0.620368
C  0.028857 1.597037 0.486229
N  0.808198 2.647386 0.726561
H  0.916681 5.953133 0.334275
H  2.279474 4.832268 0.16476
H  1.52918 5.064478 1.740872
H  -1.177107 5.060529 -0.469612
H  -2.645719 3.100989 -0.885694
H  -3.122353 0.807437 -0.157464
H  -1.77036 0.800137 -2.443472
H  -3.094828 -0.28171 -2.086384
H  -1.753624 -2.14804 -2.353146
H  0.569096 -2.291621 -2.206498
H  0.576687 0.758934 -1.858946
H  1.895826 -0.259914 -2.367924
H  4.901545 1.50143 2.105116
H  4.096489 2.701466 1.051618
H  5.268239 1.552931 0.354881
H  3.033129 -3.998183 -0.554415
H  4.335877 -3.147158 0.307958
H  4.415011 -3.327086 -1.469543
H  1.169434 0.360607 1.765235
H  -0.269892 -1.56236 1.782605
C  -4.42404 -0.013123 2.062849
H  -5.851496 -2.205803 2.300219
C  -5.570993 -4.831146 1.699956
H  -3.127504 -4.999793 0.559975
H  -1.536109 -3.168885 0.146232
F  -5.207486 -5.557403 2.772363
F  -6.814497 -4.391486 1.930661
F  -5.245584 -0.081642 3.12035
F  -5.63671 -5.683368 0.664557
F  -3.395708 0.760483 2.424733
F  -5.100424 0.654953 1.103898
elementType: C O N H F
totalener: -1997.80690046889049 hartree
nucrepener: 4596.38204522721480 hartree
electener: -6594.17559125208754 hartree
twoeener: 5296.93169644593581 hartree
cpcmener: -0.01335880587772 hartree
kineticenergy: 1989.98061535232682 hartree
xcener: -180.585508293580 hartree
s2: 0.000000
energy: -675.5675 -675.5635 -675.5448 -675.5047 -675.4959 -675.4355 -524.9763 -524.8380 -523.3742 -523.2170 -392.3905 -286.9319 -286.8674 -283.6531 -283.5319 -281.2161 -281.2056 -281.0771 -281.0560 -281.0405 -280.9501 -280.9222 -280.9214 -280.7727 -280.6485 -280.4207 -280.4185 -280.4019 -280.2495 -280.2460 -280.1442 -279.9862 -279.9443 -279.8909 -279.8355 -279.7740 -279.7468 -279.4826 -39.3321 -39.2777 -36.8507 -36.8224 -36.7518 -36.7071 -33.9358 -33.6605 -31.3378 -31.1993 -29.2711 -27.9132 -26.9764 -26.1757 -25.5708 -25.2646 -25.0540 -24.8273 -24.2170 -23.7193 -23.2895 -22.9573 -22.7261 -22.6904 -22.2047 -22.0330 -20.8016 -20.7216 -20.5800 -20.1843 -19.8579 -19.5925 -19.4425 -19.3312 -19.3198 -19.2763 -19.0158 -18.9694 -18.3312 -17.9556 -17.6279 -17.4527 -17.2575 -16.9227 -16.8267 -16.6187 -16.4257 -16.3636 -16.1721 -16.0607 -16.0080 -15.9520 -15.9326 -15.9033 -15.7796 -15.7558 -15.7375 -15.3102 -15.0015 -14.9907 -14.8685 -14.8509 -14.7493 -14.7229 -14.6555 -14.5597 -14.3616 -14.2723 -14.2430 -14.1983 -14.0974 -14.0522 -13.9657 -13.8777 -13.7218 -13.6132 -13.4822 -13.1463 -13.1243 -13.0737 -12.9384 -12.8441 -12.7611 -12.6924 -12.6594 -12.4481 -12.3296 -11.9633 -11.8045 -11.4191 -11.2857 -11.1531 -10.8782 -10.3649 -10.2408 -10.2012 -10.1364 -9.7093 -9.4646 -9.0604 -9.0061 0.3549 0.8633 0.9649 1.2922 1.4703 1.4860 1.5910 1.7309 1.7709 1.8091 1.8938 electronvolt
chargesum: -0.0000000
charge: -0.331339 -0.591460 0.084345 -0.216065 -0.615483 0.929207 -0.081403 0.039382 -0.524136 0.280948 0.554736 0.035275 -0.446839 -0.323298 -0.395867 0.144596 -0.523302 -0.129496 -0.497693 1.328465 0.244523 -1.389368 0.361434 -0.211278 0.374762 -0.409871 0.059024 -0.339062 0.021969 -0.543558 0.046043 0.123687 0.165093 0.447052 0.251819 -0.011044 0.001409 0.054832 0.212146 0.158717 0.049232 -0.009715 0.172054 0.169338 0.307757 0.289292 0.211015 0.052361 -0.078408 0.019183 0.874564 0.249786 0.860997 0.370874 0.190424 -0.343620 -0.356360 -0.361892 -0.341291 -0.310873 -0.353618
charge: 0.356744 -0.312800 0.136196 0.155838 -0.097578 -0.042003 0.183498 0.094646 0.113868 0.161297 -0.192376 -0.756134 0.270229 0.262541 0.326701 -0.739428 0.272130 0.262833 0.330325 -0.006968 0.180626 -0.120743 -0.069849 -0.040264 0.180836 -0.093729 0.164399 0.158928 -0.238325 0.342705 -0.073926 -0.069266 -0.064996 -0.054075 -0.032994 -0.046643 -0.036004 -0.038781 -0.060260 -0.049928 -0.027157 -0.029559 -0.050330 -0.055067 -0.048721 -0.048591 -0.047093 -0.050655 -0.010062 -0.038285 -1.111104 -0.031846 -1.129514 -0.032974 -0.039536 0.337259 0.336474 0.337558 0.333789 0.358081 0.330064
qa: -0.3313 -0.5915 0.0843 -0.2161 -0.6155 0.9292 -0.0814 0.0394 -0.5241 0.2809 0.5547 0.0353 -0.4468 -0.3233 -0.3959 0.1446 -0.5233 -0.1295 -0.4977 1.3285 0.2445 -1.3894 0.3614 -0.2113 0.3748 -0.4099 0.0590 -0.3391 0.0220 -0.5436 0.0460 0.1237 0.1651 0.4471 0.2518 -0.0110 0.0014 0.0548 0.2121 0.1587 0.0492 -0.0097 0.1721 0.1693 0.3078 0.2893 0.2110 0.0524 -0.0784 0.0192 0.8746 0.2498 0.8610 0.3709 0.1904 -0.3436 -0.3564 -0.3619 -0.3413 -0.3109 -0.3536
va: 4.0699 4.7349 3.4700 3.8993 2.5117 1.4765 3.7374 3.3468 3.6120 3.0942 3.2167 3.1986 1.9040 3.7022 2.1302 3.6101 1.9204 3.5227 2.1026 0.5180 3.0537 3.0413 1.9520 1.8768 2.7118 2.5970 3.3037 3.9286 2.0046 2.2121 1.1634 1.0351 1.0716 0.7290 0.8075 0.9839 1.0897 0.9644 0.8584 0.9068 0.8904 1.0813 1.3994 1.4040 1.2165 1.1434 1.2891 1.5173 0.9389 1.0487 3.1475 0.8321 3.2762 0.8438 0.9636 0.9323 0.9348 0.9402 0.9224 0.9502 0.9502
dispersion: -0.040855735 hartree
energy: -1997.847756203887 hartree
dipole: 59.825205178 -58.836423517 0.988781661 28.498517124 -28.305675290 0.192841834 -24.514502835 23.579021068 -0.935481767
dipolemethod: SCF
magnitude: 1.374773902 au
magnitude: 3.494397555 debye
