program: Orca
programVersion: 6.0.1
elementType: C C C C C C C C C C C C O C O C O C O C C C C C C C C C C N H H H H H H H H H H H H H H H H H H H H H H H H H
charge: 0
multiplicity: 1
keywords: UKS wB97X-D3 def2-QZVPPD DEF2/J RIJCOSX DEFGRID3 CPCM(Toluene) TightSCF
formula: C25H25NO4
InChI: InChI=1/C25H25NO4/c1-5-16-14-25(23(27)29-3,24(28)30-4)21-20(16)19(17-9-7-6-8-10-17)13-18-12-11-15(2)26-22(18)21/h5-13,16,20-21H,1,14H2,2-4H3
55 atoms
C  1.512395 4.827347 -0.100907
C  0.445748 3.789156 0.080792
C  -0.904529 4.110206 0.096752
C  -1.831272 3.099016 0.275149
C  -1.401665 1.787159 0.420428
C  -2.329018 0.679417 0.613538
C  -1.268398 0.326855 -3.275363
C  -1.337349 -0.588482 -2.32019
C  -0.229626 -1.068125 -1.423266
C  1.135226 -0.397349 -1.644931
C  1.7351 -0.189292 -0.24987
C  2.853545 0.854249 -0.256951
O  3.350132 1.011927 0.969679
C  4.381241 1.98876 1.103159
O  3.300139 1.380977 -1.239643
C  2.39612 -1.469195 0.279981
O  3.389146 -1.846699 -0.522144
C  4.123477 -3.006038 -0.120758
O  2.092853 -2.058746 1.283142
C  0.492744 0.1473 0.59818
C  -0.52013 -0.905909 0.118974
C  -1.945283 -0.596238 0.504551
C  -2.887468 -1.717737 0.720202
C  -3.997694 -1.57584 1.556818
C  -4.889974 -2.617164 1.744398
C  -4.691572 -3.833334 1.10475
C  -3.586054 -3.996885 0.285081
C  -2.691056 -2.953428 0.101489
C  -0.022187 1.556335 0.388977
N  0.85966 2.529262 0.234766
H  1.086217 5.808148 -0.308912
H  2.174083 4.544438 -0.921267
H  2.122912 4.898599 0.801936
H  -1.221281 5.138035 -0.02808
H  -2.892467 3.323029 0.294995
H  -3.361822 0.934307 0.824316
H  -0.360232 0.869354 -3.509954
H  -2.142496 0.56889 -3.867971
H  -2.291903 -1.084989 -2.161097
H  -0.128072 -2.140802 -1.617417
H  1.021122 0.591683 -2.087075
H  1.78847 -0.969647 -2.300175
H  4.646512 1.998965 2.156709
H  4.008118 2.96537 0.793977
H  5.244219 1.720325 0.494177
H  3.467159 -3.874777 -0.079883
H  4.576853 -2.847084 0.857133
H  4.889757 -3.144741 -0.878057
H  0.706159 0.019689 1.662721
H  -0.244209 -1.843618 0.598802
H  -4.151551 -0.644587 2.08821
H  -5.738992 -2.482282 2.404143
H  -5.388425 -4.649251 1.254206
H  -3.414841 -4.943096 -0.214435
H  -1.832816 -3.108574 -0.540874
elementType: C O N H
totalener: -1323.55730316228687 hartree
nucrepener: 3031.85857674829504 hartree
electener: -4355.40204031515805 hartree
oneelecener: -7831.03068708415231 hartree
twoeener: 3475.62864676899426 hartree
cpcmener: -0.01384689077670 hartree
kineticenergy: 1317.75193388341813 hartree
xcener: -128.478480423260 hartree
s2: -0.000000
energy: -524.8786 -524.6078 -523.2798 -522.9469 -392.3462 -283.5433 -283.3626 -281.1339 -280.9693 -280.9521 -280.9399 -280.8365 -280.2265 -280.2195 -280.2125 -280.1831 -280.1329 -280.1106 -280.0679 -279.8693 -279.8551 -279.8515 -279.8504 -279.8345 -279.8289 -279.8187 -279.7801 -279.7261 -279.4697 -279.3610 -33.8175 -33.4362 -31.2354 -30.9581 -29.2629 -27.3266 -26.7977 -25.9275 -25.0199 -25.0062 -24.4885 -23.7643 -23.6096 -23.2589 -23.1199 -22.6250 -22.4572 -21.8577 -20.6207 -20.1324 -19.8876 -19.7450 -19.3330 -19.0233 -18.7683 -18.0954 -17.9344 -17.5466 -17.2939 -17.0572 -16.9184 -16.4744 -16.3797 -16.2244 -15.9693 -15.8274 -15.7592 -15.6726 -15.2522 -15.1974 -14.9323 -14.7600 -14.6780 -14.6021 -14.2619 -14.2278 -14.1296 -13.8662 -13.8032 -13.6685 -13.4779 -13.4083 -13.2748 -13.0779 -13.0413 -12.8847 -12.7224 -12.6037 -12.5604 -12.3672 -12.2037 -12.0625 -11.8791 -11.7982 -11.3557 -11.3333 -11.1877 -10.9962 -10.8870 -10.5912 -10.1423 -10.0199 -9.7609 -9.5560 -9.4153 -9.3380 -7.9066 0.2884 1.1068 1.3681 1.5575 1.5821 1.6015 1.8104 1.8773 1.9200 1.9854 2.0415 electronvolt
chargesum: -0.0000000
charge: -0.494563 -0.703726 -0.168421 -0.164372 -0.334325 -0.162032 -0.105813 -0.807324 0.094984 0.096604 1.172097 0.050477 -0.446732 -0.277351 -0.409320 -0.135228 -0.534950 -0.429959 -0.471346 0.873090 0.576045 -0.745783 -0.474419 -0.553876 -0.158081 -0.635115 -0.095382 -0.263096 -0.167873 -0.364790 0.159090 0.230993 0.144954 0.679185 0.442161 0.117427 0.192964 0.294919 0.266578 -0.107507 0.117721 0.059497 0.104105 0.210115 0.302586 0.196889 0.304511 0.207303 0.046335 -0.090420 0.156193 0.694199 0.765846 0.514365 0.230570
charge: 0.357104 -0.302672 0.128443 0.148620 -0.110107 0.154642 0.338142 0.064306 -0.042260 0.197345 -0.210334 -0.766210 0.273233 0.253310 0.318652 -0.723650 0.278372 0.261228 0.329133 0.015881 -0.017006 -0.099459 -0.132132 0.112761 0.086363 0.075835 0.092443 0.111765 -0.203448 0.342553 -0.073140 -0.064933 -0.067067 -0.054737 -0.042548 -0.045363 -0.103229 -0.103216 -0.058316 -0.024117 -0.046279 -0.016964 -0.051036 -0.060430 -0.048890 -0.048492 -0.047606 -0.051225 0.005404 -0.031375 -0.056002 -0.061272 -0.064336 -0.060241 -0.057448
qa: -0.4946 -0.7037 -0.1684 -0.1644 -0.3343 -0.1620 -0.1058 -0.8073 0.0950 0.0966 1.1721 0.0505 -0.4467 -0.2774 -0.4093 -0.1352 -0.5349 -0.4300 -0.4713 0.8731 0.5760 -0.7458 -0.4744 -0.5539 -0.1581 -0.6351 -0.0954 -0.2631 -0.1679 -0.3648 0.1591 0.2310 0.1450 0.6792 0.4422 0.1174 0.1930 0.2949 0.2666 -0.1075 0.1177 0.0595 0.1041 0.2101 0.3026 0.1969 0.3045 0.2073 0.0463 -0.0904 0.1562 0.6942 0.7658 0.5144 0.2306
va: 4.1109 5.0425 3.8357 3.7711 2.8615 3.5266 3.6891 4.1313 3.2443 3.0338 0.6307 3.2082 1.8473 3.6202 2.1229 3.4523 1.9546 3.7179 2.0956 1.0586 0.8153 2.5549 3.2039 4.0630 3.9979 4.4187 3.8677 3.2307 1.7074 2.3576 1.0347 1.0038 1.2330 0.1902 0.6611 0.9616 1.1568 1.0675 0.6303 1.1357 0.7384 0.9793 1.5461 1.3633 1.1778 1.2295 1.0858 1.4802 0.7786 1.0339 1.1474 0.2464 0.0814 0.6222 0.8968
dispersion: -0.033538409 hartree
energy: -1323.590841571779 hartree
dipole: 1.243661227 -1.631137407 -0.387476180 2.010478354 -1.874111695 0.136366659 -4.829150472 5.065484565 0.236334093
dipolemethod: SCF
magnitude: 0.473906593 au
magnitude: 1.204574831 debye
