program: Orca
programVersion: 6.0.1
elementType: C C C C C C H C C C C C O C O C O C O C C C C C C C C C C N H H H H H H H H C H H H H H H H H H H H H H H H H
charge: 0
multiplicity: 1
keywords: UKS wB97X-D3 def2-QZVPPD DEF2/J RIJCOSX DEFGRID3 CPCM(Toluene) TightSCF
formula: C25H25NO4
InChI: InChI=1/C25H25NO4/c1-5-16-14-25(23(27)29-3,24(28)30-4)21-20(16)19(17-9-7-6-8-10-17)13-18-12-11-15(2)26-22(18)21/h5-13,16,20-21H,1,14H2,2-4H3
55 atoms
C  1.448988 4.814828 -0.066003
C  0.387054 3.778442 0.150141
C  -0.960295 4.104274 0.226484
C  -1.882178 3.095255 0.437518
C  -1.451896 1.780443 0.556848
C  -2.375426 0.675417 0.783614
H  -2.012386 -3.088952 -0.45732
C  -1.445461 -0.548661 -2.197509
C  -0.370126 -1.117311 -1.322307
C  0.995587 -0.455962 -1.608655
C  1.650348 -0.211945 -0.243739
C  2.762376 0.835653 -0.319544
O  3.326569 1.000679 0.87658
C  4.363349 1.977896 0.94748
O  3.150491 1.359387 -1.328202
C  2.337571 -1.4803 0.280975
O  3.310314 -1.85873 -0.545103
C  4.06215 -3.010555 -0.154334
O  2.065974 -2.062332 1.297385
C  0.443205 0.134255 0.651304
C  -0.592434 -0.920124 0.223279
C  -2.002056 -0.601766 0.656965
C  -2.942519 -1.7158 0.914096
C  -3.983378 -1.575192 1.835266
C  -4.875858 -2.607492 2.068988
C  -4.745049 -3.811885 1.391565
C  -3.707365 -3.973411 0.486541
C  -2.812342 -2.939643 0.256525
C  -0.075521 1.544906 0.464425
N  0.802168 2.516221 0.277273
H  1.017907 5.79697 -0.256864
H  2.081898 4.532587 -0.908951
H  2.089496 4.882979 0.816101
H  -1.278281 5.134148 0.123621
H  -2.940672 3.322577 0.505791
H  -3.399128 0.932562 1.032796
H  -2.927684 -0.78766 -3.672247
H  -2.036398 -2.325599 -3.158217
C  -2.172001 -1.253743 -3.051388
H  -0.304112 -2.188623 -1.52432
H  0.855745 0.516195 -2.084771
H  1.619514 -1.050626 -2.272588
H  4.684267 1.995568 1.98531
H  3.975131 2.952582 0.651289
H  5.192638 1.704017 0.29562
H  3.413843 -3.884544 -0.099298
H  4.531978 -2.845212 0.814624
H  4.815499 -3.145022 -0.925234
H  0.701701 0.010785 1.706397
H  -0.30263 -1.85426 0.70265
H  -4.080162 -0.652768 2.395059
H  -5.669761 -2.474473 2.794525
H  -5.441436 -4.621014 1.576269
H  -3.590479 -4.910799 -0.044353
H  -1.607539 0.524536 -2.118687
elementType: C H O N
totalener: -1323.55935318738875 hartree
nucrepener: 3023.57999496220145 hartree
electener: -4347.12539981516875 hartree
oneelecener: -7814.40675722917149 hartree
twoeener: 3467.28135741400274 hartree
cpcmener: -0.01395477718672 hartree
kineticenergy: 1317.75346484087936 hartree
xcener: -128.475476083290 hartree
s2: 0.000000
energy: -524.8830 -524.6135 -523.2855 -522.9568 -392.3731 -283.5492 -283.3734 -281.1367 -280.9999 -280.9678 -280.9581 -280.8471 -280.2523 -280.2415 -280.1900 -280.1678 -280.1633 -280.0649 -280.0590 -279.8822 -279.8207 -279.8165 -279.8164 -279.8047 -279.7983 -279.7835 -279.7834 -279.7542 -279.4877 -279.4079 -33.8243 -33.4417 -31.2419 -30.9683 -29.2885 -27.3178 -26.7654 -25.9340 -25.0500 -25.0244 -24.4983 -23.7674 -23.5722 -23.2550 -23.1298 -22.6808 -22.4372 -21.8556 -20.6257 -20.1161 -19.7455 -19.6146 -19.3148 -19.0007 -18.7833 -18.2576 -18.0280 -17.5508 -17.3988 -17.1681 -16.8979 -16.4976 -16.4206 -16.2005 -15.9584 -15.8353 -15.7645 -15.3351 -15.2779 -15.0824 -14.9053 -14.8022 -14.6790 -14.5851 -14.4005 -14.2217 -14.1019 -13.8463 -13.7543 -13.7099 -13.5960 -13.4251 -13.3098 -13.0694 -12.9148 -12.8482 -12.7718 -12.7041 -12.5148 -12.3763 -12.1769 -12.0938 -11.9535 -11.7537 -11.4681 -11.2610 -11.1889 -11.0075 -10.8892 -10.6044 -10.1448 -10.0347 -9.6287 -9.5802 -9.4793 -9.3359 -7.9243 0.3143 1.0792 1.3790 1.5546 1.5898 1.6428 1.8211 1.8702 1.9195 1.9836 2.0464 electronvolt
chargesum: -0.0000000
charge: -0.545805 -0.689148 -0.216697 -0.149505 -0.383043 -0.180763 0.259140 -0.737796 0.192064 0.402102 0.804709 0.194105 -0.430209 -0.257074 -0.405669 -0.085473 -0.532108 -0.399709 -0.477786 1.029265 0.276787 -0.833231 -0.441961 -0.530498 -0.167781 -0.724156 -0.049736 -0.374792 -0.076462 -0.413727 0.157001 0.243597 0.185896 0.707863 0.484146 0.117203 0.064422 0.307031 0.118298 -0.110579 0.036489 0.092022 0.097025 0.181417 0.327872 0.187323 0.276499 0.228127 0.049647 -0.142370 0.195438 0.716734 0.787023 0.545342 0.091490
charge: 0.357100 -0.302571 0.128604 0.148035 -0.116641 0.150144 -0.061419 0.046089 -0.055446 0.211925 -0.211694 -0.767560 0.272520 0.253325 0.318022 -0.724319 0.277666 0.261444 0.329369 0.014473 -0.014223 -0.092426 -0.127093 0.111468 0.085465 0.075030 0.092157 0.115165 -0.206880 0.342272 -0.073026 -0.065080 -0.066546 -0.054567 -0.042477 -0.044913 -0.105056 -0.096538 0.334766 -0.029734 -0.024336 -0.020098 -0.050955 -0.060890 -0.048698 -0.048236 -0.047799 -0.051192 0.004896 -0.028141 -0.055549 -0.061680 -0.064616 -0.060494 -0.049042
qa: -0.5458 -0.6891 -0.2167 -0.1495 -0.3830 -0.1808 0.2591 -0.7378 0.1921 0.4021 0.8047 0.1941 -0.4302 -0.2571 -0.4057 -0.0855 -0.5321 -0.3997 -0.4778 1.0293 0.2768 -0.8332 -0.4420 -0.5305 -0.1678 -0.7242 -0.0497 -0.3748 -0.0765 -0.4137 0.1570 0.2436 0.1859 0.7079 0.4841 0.1172 0.0644 0.3070 0.1183 -0.1106 0.0365 0.0920 0.0970 0.1814 0.3279 0.1873 0.2765 0.2281 0.0496 -0.1424 0.1954 0.7167 0.7870 0.5453 0.0915
va: 4.1199 5.0728 3.8847 3.7265 2.7958 3.4986 0.8315 4.4979 2.9890 2.9319 1.3583 3.1144 1.8228 3.6162 2.1378 3.5466 1.9345 3.7159 2.0889 0.5366 0.9242 2.4966 3.1543 4.1168 4.0194 4.5345 3.7866 3.4323 1.8045 2.3630 1.0643 1.0077 1.1839 0.1720 0.5814 0.9753 1.2657 0.9914 3.6074 1.1309 0.9032 0.9717 1.5300 1.4202 1.1322 1.2239 1.1140 1.4389 0.7860 1.0864 1.0760 0.2293 0.0338 0.5828 0.8426
dispersion: -0.033453951 hartree
energy: -1323.592807137909 hartree
dipole: 0.495671864 -0.774973306 -0.279301442 0.489979653 -0.255509586 0.234470067 -4.726056016 4.971072482 0.245016466
dipolemethod: SCF
magnitude: 0.439338795 au
magnitude: 1.116710470 debye
