program: Orca
programVersion: 6.0.1
elementType: C C C C C C C C C C C C O C O C O C O C C C C C C C C C C N H H H H H H H H H H H H H H H H H H H H H H H H H
charge: 0
multiplicity: 3
keywords: UKS wB97X-D3 def2-QZVPPD DEF2/J RIJCOSX DEFGRID3 CPCM(Toluene) TightSCF
formula: C25H25NO4
InChI: InChI=1/C25H25NO4/c1-5-16-14-25(23(27)29-3,24(28)30-4)21-20(16)19(17-9-7-6-8-10-17)13-18-12-11-15(2)26-22(18)21/h5-13,16,20-21H,1,14H2,2-4H3
55 atoms
C  1.466109 4.748291 0.827928
C  0.409663 3.719298 0.570964
C  -0.897163 4.071044 0.204724
C  -1.820548 3.086749 -0.015025
C  -1.45352 1.722446 0.129788
C  -2.357603 0.685909 -0.035068
C  -1.256401 -0.073544 -3.608046
C  -1.263553 -0.885925 -2.561299
C  -0.134558 -1.1297 -1.602332
C  1.096623 -0.239747 -1.782059
C  1.708846 -0.13937 -0.382754
C  2.770925 0.95546 -0.290443
O  3.402956 0.896525 0.880033
C  4.402626 1.889877 1.103165
O  3.060529 1.710747 -1.178814
C  2.426068 -1.439431 0.001348
O  3.414744 -1.695288 -0.852883
C  4.202134 -2.857187 -0.579018
O  2.160032 -2.142919 0.939515
C  0.453048 0.051891 0.505161
C  -0.518481 -1.00907 -0.075527
C  -1.949218 -0.710629 0.218099
C  -2.857092 -1.660004 0.723341
C  -4.178174 -1.284121 1.09983
C  -5.077577 -2.20619 1.589737
C  -4.722912 -3.54667 1.718811
C  -3.438211 -3.947788 1.349817
C  -2.525328 -3.037703 0.869008
C  -0.082883 1.467403 0.445917
N  0.77871 2.438824 0.673233
H  1.065085 5.759251 0.765426
H  2.269895 4.644654 0.094759
H  1.905658 4.604375 1.817064
H  -1.164304 5.115757 0.10402
H  -2.841615 3.330434 -0.286399
H  -3.355254 0.909232 -0.393354
H  -0.399951 0.539635 -3.864858
H  -2.123014 0.004954 -4.253395
H  -2.156095 -1.477519 -2.368361
H  0.162968 -2.173541 -1.753746
H  0.80994 0.770268 -2.08056
H  1.79847 -0.61338 -2.525235
H  4.797493 1.695437 2.096432
H  3.954737 2.882475 1.059295
H  5.191576 1.811049 0.355639
H  3.578575 -3.75042 -0.594174
H  4.681846 -2.765501 0.39498
H  4.947158 -2.900319 -1.368198
H  0.683925 -0.186678 1.544968
H  -0.247374 -1.946535 0.398653
H  -4.481708 -0.249014 1.01399
H  -6.07156 -1.881358 1.874774
H  -5.435355 -4.269372 2.096671
H  -3.152511 -4.989331 1.440841
H  -1.541648 -3.388841 0.586526
elementType: C O N H
totalener: -1323.47800065320621 hartree
nucrepener: 3024.94597716754333 hartree
electener: -4348.41047704976700 hartree
oneelecener: -7816.94097422977029 hartree
twoeener: 3468.53049718000284 hartree
cpcmener: -0.01350785476877 hartree
kineticenergy: 1317.68417042798933 hartree
xcener: -128.456959063470 hartree
s2: 2.099606
energy: -524.8985 -524.6590 -523.2993 -523.0277 -392.3794 -283.5576 -283.4105 -281.1497 -281.1170 -280.9961 -280.9818 -280.8730 -280.3567 -280.3257 -280.2471 -280.2247 -280.1498 -280.1489 -280.1184 -280.0761 -279.8791 -279.8410 -279.8323 -279.8097 -279.8012 -279.7665 -279.7659 -279.7628 -279.4945 -279.3876 -33.8435 -33.4864 -31.2535 -31.0233 -29.2960 -27.3826 -26.7566 -25.9999 -25.1111 -25.0840 -24.5458 -23.8127 -23.6054 -23.2889 -23.1449 -22.7428 -22.5098 -21.7760 -20.6484 -20.4096 -19.9556 -19.7338 -19.2599 -19.0668 -18.8071 -18.1307 -18.0098 -17.6112 -17.2699 -17.0695 -17.0321 -16.5039 -16.4002 -16.2558 -16.0431 -15.8854 -15.7768 -15.7121 -15.3695 -15.1451 -14.9591 -14.8283 -14.6827 -14.6512 -14.3577 -14.3095 -14.1628 -13.8517 -13.8193 -13.7228 -13.5790 -13.5255 -13.3308 -13.2137 -13.1278 -12.9616 -12.8001 -12.6381 -12.5863 -12.4089 -12.2434 -12.1382 -12.0667 -11.7439 -11.5198 -11.3424 -11.2554 -11.0450 -10.9581 -10.7062 -10.4172 -10.0897 -10.0552 -9.6265 -9.5489 -9.4734 -7.9481 -5.9648 0.9411 1.3578 1.5369 1.5686 1.5835 1.7067 1.8248 1.9303 1.9452 2.0083 2.1142 electronvolt
energy: -524.8982 -524.6587 -523.2990 -523.0284 -392.4353 -283.5577 -283.4102 -281.1496 -281.0375 -280.9818 -280.9094 -280.8688 -280.3194 -280.2694 -280.1982 -280.1805 -280.1788 -280.1005 -280.0860 -279.9876 -279.9179 -279.8104 -279.8096 -279.8077 -279.7713 -279.7657 -279.7582 -279.7194 -279.4998 -279.3851 -33.8427 -33.4860 -31.2528 -31.0241 -29.2288 -27.2436 -26.6376 -25.7555 -25.0119 -24.9654 -24.3755 -23.7495 -23.5126 -23.1432 -23.0792 -22.6548 -22.4396 -21.5432 -20.5509 -20.1132 -19.9069 -19.6258 -19.1617 -18.9574 -18.7673 -18.0992 -17.9459 -17.5397 -17.2057 -17.0229 -16.9408 -16.4647 -16.3233 -16.2042 -15.9354 -15.8754 -15.7655 -15.6767 -15.2787 -15.0713 -14.8462 -14.7065 -14.5933 -14.4914 -14.2716 -14.2500 -14.0763 -13.8307 -13.7386 -13.6323 -13.4700 -13.3661 -13.1533 -13.0513 -12.9929 -12.9211 -12.7337 -12.5964 -12.3684 -12.2997 -12.1790 -12.0643 -11.9866 -11.7157 -11.4470 -11.2521 -11.0616 -11.0187 -10.6656 -10.5165 -10.0726 -9.8360 -9.7066 -9.5553 -9.3025 -9.1660 -1.5173 0.3515 1.2863 1.3813 1.5604 1.5987 1.7854 1.8114 1.9111 1.9472 2.0003 electronvolt
chargesum: 0.0000000
charge: -0.396314 -0.670364 -0.008473 -0.214995 -0.391046 -0.542471 -0.312247 -0.591302 -0.143756 0.019957 0.911869 0.051082 -0.397995 -0.195389 -0.411861 -0.177393 -0.519199 -0.384499 -0.486249 0.947261 0.309871 -0.534116 -0.500148 -0.464335 -0.192617 -0.695227 -0.147941 -0.331483 0.129219 -0.525434 0.143343 0.219147 0.187917 0.722511 0.568062 0.146446 0.260085 0.225723 0.302524 0.111805 0.043501 0.136079 0.083253 0.078268 0.374553 0.222541 0.273293 0.167228 0.024068 0.075262 0.265997 0.710424 0.690310 0.585467 0.247790
charge: 0.352886 -0.297096 0.122903 0.153253 -0.128162 0.178466 0.333363 0.061439 -0.039190 0.184786 -0.210866 -0.761297 0.273476 0.255875 0.323246 -0.730399 0.279322 0.261798 0.330322 0.026273 -0.021363 -0.073793 -0.147706 0.120221 0.076309 0.078516 0.078583 0.128292 -0.191137 0.332592 -0.072995 -0.067383 -0.064308 -0.053594 -0.044959 -0.053013 -0.100700 -0.104660 -0.052162 -0.012093 -0.030915 -0.015102 -0.050220 -0.063352 -0.048079 -0.048730 -0.047087 -0.051252 0.001309 -0.052829 -0.067100 -0.061726 -0.068737 -0.061275 -0.059952
qa: -0.3963 -0.6704 -0.0085 -0.2150 -0.3910 -0.5425 -0.3122 -0.5913 -0.1438 0.0200 0.9119 0.0511 -0.3980 -0.1954 -0.4119 -0.1774 -0.5192 -0.3845 -0.4862 0.9473 0.3099 -0.5341 -0.5001 -0.4643 -0.1926 -0.6952 -0.1479 -0.3315 0.1292 -0.5254 0.1433 0.2191 0.1879 0.7225 0.5681 0.1464 0.2601 0.2257 0.3025 0.1118 0.0435 0.1361 0.0833 0.0783 0.3746 0.2225 0.2733 0.1672 0.0241 0.0753 0.2660 0.7104 0.6903 0.5855 0.2478
va: 4.0646 5.0580 3.6337 3.5784 3.3474 3.4523 3.9320 4.1554 3.1189 2.4989 0.9486 3.1603 1.8608 3.6724 2.1132 3.5413 1.9523 3.7667 2.0768 1.3132 1.3374 2.4579 3.3970 3.8007 3.9202 4.4034 3.8432 3.3100 1.8923 2.3308 1.0251 1.0312 1.0421 0.1381 0.4323 0.9272 1.0275 1.1442 0.6806 0.8733 0.8053 0.9262 1.3474 1.4641 1.1683 1.1974 1.1006 1.4612 0.8389 0.7351 0.9797 0.2324 0.2579 0.4455 0.9528
dispersion: -0.033378596 hartree
energy: -1323.511379248782 hartree
dipole: 1.769808711 -1.815428544 -0.045619833 1.688036952 -1.488139473 0.199897478 -4.030265150 3.997119562 -0.033145587
dipolemethod: SCF
magnitude: 0.207698823 au
magnitude: 0.527928452 debye
