program: Orca
programVersion: 6.0.1
elementType: C C C C C C C C C C C C O C O C O C O C C C C C C C C C C N H H H H H H H H H H H H H H H H H H H H C H H H H F F F
charge: 0
multiplicity: 1
keywords: UKS wB97X-D3 def2-QZVPPD DEF2/J RIJCOSX DEFGRID3 CPCM(Toluene) TightSCF
formula: C26H24F3NO4
InChI: InChI=1/C26H24F3NO4/c1-5-15-13-25(23(31)33-3,24(32)34-4)21-20(15)18(12-16-11-10-14(2)30-22(16)21)17-8-6-7-9-19(17)26(27,28)29/h5-12,15,20-21H,1,13H2,2-4H3
58 atoms
C  1.264944 4.767101 -0.594015
C  0.232466 3.734642 -0.252643
C  -1.115184 4.045684 -0.159514
C  -2.01232 3.041132 0.161632
C  -1.554682 1.750358 0.366312
C  -2.466028 0.64005 0.637756
C  -0.503889 0.731235 -3.081163
C  -1.051215 -0.167245 -2.276119
C  -0.351192 -1.150084 -1.372152
C  1.181594 -1.095733 -1.407338
C  1.649008 -0.32595 -0.140051
C  2.661398 0.775834 -0.466955
O  3.247425 1.206381 0.648393
C  4.193078 2.261749 0.492633
O  2.960583 1.14134 -1.571657
C  2.386448 -1.309094 0.778242
O  3.511599 -1.728028 0.201169
C  4.298996 -2.658684 0.947669
O  2.010601 -1.690704 1.854287
C  0.351453 0.140326 0.567539
C  -0.65008 -0.940177 0.140603
C  -2.071385 -0.625556 0.523903
C  -3.00511 -1.768106 0.728756
C  -3.341593 -2.258762 1.995632
C  -4.217403 -3.327946 2.129487
C  -4.763276 -3.932828 1.009845
C  -4.429612 -3.465779 -0.250065
C  -3.558249 -2.396627 -0.383287
C  -0.173445 1.528893 0.260935
N  0.678526 2.494686 -0.026839
H  0.806597 5.695293 -0.933828
H  1.927061 4.390636 -1.375171
H  1.88056 4.98808 0.281167
H  -1.454724 5.058053 -0.338605
H  -3.07332 3.254022 0.236288
H  -3.490845 0.879602 0.900778
H  0.566656 0.882185 -3.157754
H  -1.128886 1.374167 -3.689409
H  -2.136676 -0.227395 -2.251214
H  -0.696253 -2.146608 -1.663103
H  1.570829 -0.609188 -2.297406
H  1.589565 -2.105561 -1.401409
H  4.54388 2.496191 1.493838
H  3.708992 3.129789 0.04575
H  5.022309 1.941964 -0.138162
H  3.722253 -3.557818 1.161839
H  4.630391 -2.207979 1.882723
H  5.151253 -2.894448 0.316724
H  0.504299 0.096346 1.648818
H  -0.361878 -1.864651 0.64697
C  -2.774098 -1.626439 3.243418
H  -4.472938 -3.690752 3.115686
H  -5.44565 -4.765437 1.125661
H  -4.850743 -3.928948 -1.134183
H  -3.307948 -2.031578 -1.371921
F  -1.441292 -1.478556 3.182578
F  -3.29283 -0.406278 3.474467
F  -3.026657 -2.357141 4.340276
elementType: C O N H F
totalener: -1660.68005144834456 hartree
nucrepener: 3862.77407922918383 hartree
electener: -5523.44028399983472 hartree
oneelecener: -9959.51172229141230 hartree
twoeener: 4436.07143829157758 hartree
cpcmener: -0.01385596413465 hartree
kineticenergy: 1653.86874304756657 hartree
xcener: -154.531152941116 hartree
s2: 0.000000
energy: -675.3511 -675.2877 -675.2492 -524.8201 -524.5879 -523.2380 -522.9744 -392.2842 -286.6708 -283.4897 -283.3674 -281.1046 -280.9924 -280.9307 -280.9138 -280.8776 -280.7282 -280.7131 -280.3165 -280.2623 -280.2275 -280.2116 -280.1895 -280.1810 -280.1602 -280.1417 -280.1032 -280.1017 -279.9211 -279.8082 -279.7650 -279.7543 -279.4625 -279.3384 -39.0744 -36.5871 -36.5173 -33.7868 -33.4228 -31.1947 -30.9730 -29.2142 -27.5594 -27.1244 -25.9805 -25.0660 -24.9836 -24.7791 -24.5488 -23.8486 -23.4542 -23.0803 -22.6845 -22.5401 -22.2979 -21.8691 -20.4783 -20.4105 -20.2293 -19.9146 -19.5471 -19.4998 -19.0823 -18.9033 -18.7677 -18.5042 -18.0154 -17.8372 -17.6097 -17.2279 -17.0491 -16.7952 -16.4320 -16.3189 -16.1535 -15.9684 -15.8880 -15.8087 -15.7589 -15.7258 -15.6639 -15.4955 -15.3185 -15.1017 -14.8696 -14.7146 -14.6776 -14.6305 -14.3531 -14.2638 -14.1735 -14.0253 -14.0158 -13.8311 -13.8125 -13.6781 -13.4679 -13.3989 -13.3016 -13.1214 -12.9470 -12.8546 -12.8433 -12.7258 -12.5848 -12.4329 -12.3081 -12.0845 -12.0322 -11.9476 -11.4726 -11.3822 -11.1734 -11.0079 -10.8085 -10.5830 -10.0712 -9.9624 -9.8698 -9.7159 -9.5393 -9.4784 -8.1979 0.7103 0.9847 1.1969 1.2936 1.3864 1.5495 1.6077 1.7524 1.8419 1.9959 2.0838 electronvolt
chargesum: -0.0000000
charge: -0.388684 -0.758044 -0.094813 0.023224 -0.353566 -0.199532 0.224430 -0.772578 -0.127527 0.712296 0.207713 0.070979 -0.462390 -0.138075 -0.427814 -0.012475 -0.445704 -0.270444 -0.480413 0.887391 0.914570 -0.779566 0.066511 -0.375445 -0.302267 -0.666246 -0.539868 -0.195107 0.342859 -0.648766 0.122648 0.272178 0.182490 0.557859 0.307658 0.152209 -0.027982 0.426296 0.231396 -0.006824 -0.095717 -0.023477 0.071848 0.081994 0.346014 0.218578 0.230304 0.137910 -0.074720 -0.168480 0.875422 0.480318 0.861151 0.634720 0.192030 -0.295277 -0.340868 -0.360329
charge: 0.354691 -0.303718 0.128117 0.147072 -0.113541 0.158583 0.343349 0.070379 -0.043897 0.222222 -0.177160 -0.760188 0.269301 0.254321 0.311714 -0.734473 0.271970 0.259963 0.330175 0.020858 -0.026040 -0.113611 -0.097358 -0.070259 0.134729 0.104305 0.109953 0.136830 -0.207092 0.342875 -0.072178 -0.067473 -0.065035 -0.054874 -0.042076 -0.028865 -0.103715 -0.098027 -0.062701 -0.019209 -0.055449 -0.022767 -0.049490 -0.066776 -0.047702 -0.048551 -0.047101 -0.051336 -0.006826 -0.006072 -1.109953 -0.047660 -0.057200 -0.054971 -0.050332 0.346731 0.338091 0.327449
qa: -0.3887 -0.7580 -0.0948 0.0232 -0.3536 -0.1995 0.2244 -0.7726 -0.1275 0.7123 0.2077 0.0710 -0.4624 -0.1381 -0.4278 -0.0125 -0.4457 -0.2704 -0.4804 0.8874 0.9146 -0.7796 0.0665 -0.3754 -0.3023 -0.6662 -0.5399 -0.1951 0.3429 -0.6488 0.1226 0.2722 0.1825 0.5579 0.3077 0.1522 -0.0280 0.4263 0.2314 -0.0068 -0.0957 -0.0235 0.0718 0.0820 0.3460 0.2186 0.2303 0.1379 -0.0747 -0.1685 0.8754 0.4803 0.8612 0.6347 0.1920 -0.2953 -0.3409 -0.3603
va: 4.0427 4.9966 3.8307 3.6171 2.9759 4.0607 3.4555 3.7028 3.0097 2.6336 2.3396 3.3802 1.8782 3.7483 2.1207 3.4080 1.8245 3.7261 2.1010 0.7505 1.9702 3.3006 1.4890 2.4428 3.9519 4.4084 4.2200 3.9500 1.3380 2.3922 0.9711 0.9501 1.1370 0.4750 0.7862 0.9286 1.2726 0.6476 0.6895 0.9063 1.2355 1.0997 1.2932 1.3345 1.1546 1.1997 1.1995 1.4296 0.9490 1.1629 3.1199 0.8869 0.0032 0.4709 1.0087 0.8090 0.9773 0.9240
dispersion: -0.038504930 hartree
energy: -1660.718556378324 hartree
dipole: 19.939437747 -20.549313756 -0.609876010 12.120186248 -12.405314763 -0.285128514 -27.686608005 27.007069770 -0.679538236
dipolemethod: SCF
magnitude: 0.956566375 au
magnitude: 2.431398499 debye
