program: Orca
programVersion: 6.0.1
elementType: C C C C C C C C C C C C O C O C O C O C C C C C C C C C C N H H H H H H H H H H H H H H H H H H H H C H C H H F F F F F F
charge: 0
multiplicity: 1
keywords: UKS wB97X-D3 def2-QZVPPD DEF2/J RIJCOSX DEFGRID3 CPCM(Toluene) TightSCF
formula: C27H23F6NO4
InChI: InChI=1/C27H23F6NO4/c1-5-14-12-25(23(35)37-3,24(36)38-4)21-20(14)18(10-15-7-6-13(2)34-22(15)21)17-9-8-16(26(28,29)30)11-19(17)27(31,32)33/h5-11,14,20-21H,1,12H2,2-4H3
61 atoms
C  1.261559 4.764718 -0.597829
C  0.230304 3.732484 -0.252969
C  -1.11736 4.043415 -0.156782
C  -2.013443 3.03897 0.166767
C  -1.554357 1.748534 0.3706
C  -2.46465 0.637991 0.64352
C  -0.507307 0.734215 -3.080065
C  -1.052953 -0.165584 -2.27549
C  -0.350781 -1.14941 -1.37415
C  1.181981 -1.093165 -1.410386
C  1.649747 -0.326464 -0.141562
C  2.662228 0.775953 -0.466473
O  3.246461 1.205929 0.649744
C  4.193373 2.260752 0.495641
O  2.962025 1.141966 -1.570758
C  2.386269 -1.312433 0.774695
O  3.512704 -1.727932 0.198892
C  4.299126 -2.661908 0.942839
O  2.007032 -1.698549 1.848075
C  0.352715 0.138459 0.567487
C  -0.648073 -0.942472 0.139483
C  -2.068121 -0.626598 0.526526
C  -3.000582 -1.768984 0.73132
C  -3.344914 -2.252994 1.997084
C  -4.220047 -3.320825 2.133763
C  -4.755348 -3.92528 1.011164
C  -4.414251 -3.469901 -0.252643
C  -3.544627 -2.404093 -0.382688
C  -0.173547 1.526895 0.262311
N  0.677354 2.492782 -0.027604
H  0.802334 5.692653 -0.936992
H  1.921599 4.387485 -1.380349
H  1.879451 4.986019 0.275636
H  -1.457433 5.055609 -0.335507
H  -3.07431 3.251512 0.24385
H  -3.488971 0.876616 0.909134
H  0.563035 0.885491 -3.158385
H  -1.133497 1.377348 -3.686799
H  -2.138469 -0.225892 -2.249734
H  -0.693813 -2.146137 -1.66702
H  1.569587 -0.603516 -2.299419
H  1.59119 -2.102493 -1.408035
H  4.542402 2.494974 1.49749
H  3.71074 3.129023 0.047672
H  5.023454 1.940071 -0.133516
H  3.722193 -3.562176 1.151506
H  4.628397 -2.215177 1.880502
H  5.152632 -2.894339 0.312416
H  0.506268 0.093314 1.648605
H  -0.358401 -1.86727 0.644529
C  -2.784165 -1.617196 3.2485
H  -4.48391 -3.679217 3.1185
C  -5.677523 -5.106379 1.144113
H  -4.832338 -3.938654 -1.134757
H  -3.290565 -2.045243 -1.371892
F  -1.452402 -1.473577 3.191306
F  -3.304302 -0.39767 3.469487
F  -3.046031 -2.346669 4.342247
F  -6.194276 -5.217841 2.373802
F  -6.706683 -5.033491 0.285423
F  -5.039188 -6.261349 0.88122
elementType: C O N H F
totalener: -1997.81044321419245 hartree
nucrepener: 4589.46098774558413 hartree
electener: -6587.25720105084747 hartree
twoeener: 5290.37665429232311 hartree
cpcmener: -0.01424084576340 hartree
kineticenergy: 1989.98686334582271 hartree
xcener: -180.584765351803 hartree
s2: 0.000000
energy: -675.5891 -675.5327 -675.5178 -675.4619 -675.4548 -675.4187 -524.8718 -524.6382 -523.2932 -523.0250 -392.3565 -286.8968 -286.8721 -283.5458 -283.4195 -281.1444 -281.1003 -281.0774 -281.0634 -280.9904 -280.9734 -280.9726 -280.9429 -280.8116 -280.7246 -280.5274 -280.4182 -280.3001 -280.2820 -280.2728 -280.1944 -280.1890 -280.0792 -279.8775 -279.8336 -279.8305 -279.5133 -279.4107 -39.3062 -39.2588 -36.8511 -36.7670 -36.7339 -36.6993 -33.8399 -33.4740 -31.2491 -31.0246 -29.2927 -27.9868 -27.3179 -26.2045 -25.5536 -25.0817 -25.0608 -24.8213 -24.2230 -23.7018 -23.1326 -22.8836 -22.7283 -22.6821 -22.4146 -21.8902 -20.7645 -20.7187 -20.5429 -20.0057 -19.6827 -19.6331 -19.4934 -19.3425 -19.3069 -19.2601 -19.0254 -18.8192 -18.2074 -17.9212 -17.7528 -17.5725 -17.3913 -17.1540 -16.9151 -16.5117 -16.4008 -16.2918 -16.2163 -15.9753 -15.9441 -15.9097 -15.8952 -15.8508 -15.7740 -15.7578 -15.5579 -15.3917 -15.1737 -14.9310 -14.8758 -14.8144 -14.7469 -14.7043 -14.6819 -14.5409 -14.3114 -14.2633 -14.2061 -14.1763 -14.1014 -14.0595 -13.8757 -13.7613 -13.6055 -13.5176 -13.3924 -13.2184 -13.0237 -13.0152 -12.9317 -12.8982 -12.6709 -12.6207 -12.4802 -12.1789 -12.1385 -12.0283 -11.6033 -11.4836 -11.2291 -11.0840 -10.8859 -10.6515 -10.2454 -10.1740 -10.0411 -10.0206 -9.6738 -9.5783 -8.3080 0.4351 0.6604 0.8741 1.1379 1.3159 1.4945 1.5544 1.7003 1.7683 1.9425 1.9796 electronvolt
chargesum: 0.0000000
charge: -0.402305 -0.783434 -0.091049 0.001594 -0.366497 -0.108163 0.227433 -0.830593 -0.096712 0.709630 0.100453 0.151301 -0.443881 -0.125664 -0.423868 0.085769 -0.455657 -0.305681 -0.484119 1.022054 0.800658 -0.850310 0.081538 -0.284017 0.320665 -0.516131 -0.203021 -0.117802 0.253636 -0.662373 0.123111 0.263665 0.179301 0.606327 0.331089 0.196808 -0.041814 0.444384 0.224749 -0.025409 -0.109543 -0.035372 0.055123 0.100652 0.337754 0.252129 0.262972 0.102206 -0.098387 -0.189969 0.950731 0.408921 0.850673 0.479266 0.195949 -0.315314 -0.343269 -0.375647 -0.355262 -0.336409 -0.342867
charge: 0.355589 -0.302366 0.129428 0.148111 -0.113025 0.160810 0.344424 0.070418 -0.043722 0.222752 -0.177119 -0.760509 0.269598 0.255066 0.312247 -0.734785 0.272609 0.261047 0.330020 0.021261 -0.025195 -0.111621 -0.080589 -0.043665 0.186644 -0.093339 0.162388 0.166605 -0.206943 0.343607 -0.071886 -0.067078 -0.064718 -0.054392 -0.041557 -0.027730 -0.103137 -0.097442 -0.062468 -0.019190 -0.055288 -0.022396 -0.049391 -0.066554 -0.047538 -0.048422 -0.046961 -0.051151 -0.006491 -0.005636 -1.108909 -0.034165 -1.130141 -0.033201 -0.044416 0.352443 0.344086 0.335319 0.337576 0.334353 0.336734
qa: -0.4023 -0.7834 -0.0910 0.0016 -0.3665 -0.1082 0.2274 -0.8306 -0.0967 0.7096 0.1005 0.1513 -0.4439 -0.1257 -0.4239 0.0858 -0.4557 -0.3057 -0.4841 1.0221 0.8007 -0.8503 0.0815 -0.2840 0.3207 -0.5161 -0.2030 -0.1178 0.2536 -0.6624 0.1231 0.2637 0.1793 0.6063 0.3311 0.1968 -0.0418 0.4444 0.2247 -0.0254 -0.1095 -0.0354 0.0551 0.1007 0.3378 0.2521 0.2630 0.1022 -0.0984 -0.1900 0.9507 0.4089 0.8507 0.4793 0.1959 -0.3153 -0.3433 -0.3756 -0.3553 -0.3364 -0.3429
va: 4.0290 5.0526 3.8412 3.6729 3.0729 3.8125 3.4863 3.7911 3.0783 2.5672 2.4804 3.1044 1.8661 3.7157 2.0965 3.1538 1.8936 3.7239 2.1020 0.5812 2.3143 3.3873 1.1243 1.9268 2.6324 2.8961 3.5915 3.7479 1.4883 2.4141 0.9819 0.9703 1.1685 0.4251 0.7648 0.8212 1.2892 0.6299 0.7109 0.9218 1.2419 1.1347 1.3130 1.3358 1.1728 1.1598 1.1575 1.4887 1.0096 1.2051 2.9993 0.8211 3.2856 0.7714 0.9785 0.8223 0.9577 0.9267 0.9416 0.9202 0.9322
dispersion: -0.040562476 hartree
energy: -1997.851005689925 hartree
dipole: 51.536716330 -51.268557885 0.268158445 41.623979848 -40.815827168 0.808152680 -31.222218549 30.445077953 -0.777140596
dipolemethod: SCF
magnitude: 1.152808402 au
magnitude: 2.930206090 debye
