program: Orca
programVersion: 6.0.1
elementType: C C C C C C H C C C C C O C O C O C O C C C C C C C C C C N H H H H H H H H C H H H H H H H H H H H H H H H H
charge: 0
multiplicity: 3
keywords: UKS wB97X-D3 def2-QZVPPD DEF2/J RIJCOSX DEFGRID3 CPCM(Toluene) TightSCF
formula: C25H25NO4
InChI: InChI=1/C25H25NO4/c1-13-10-11-16-18-14(2)17-12-25(23(27)29-3,24(28)30-4)21(22(16)26-13)20(17)19(18)15-8-6-5-7-9-15/h5-11,14,17-18,20-21H,2,12H2,1,3-4H3
55 atoms
C  0.791553 4.333472 1.568861
C  -0.017111 3.280739 0.870012
C  -1.204967 3.582675 0.215605
C  -1.896136 2.567402 -0.419276
C  -1.392709 1.276849 -0.403539
C  -2.126368 0.111072 -1.035778
H  -1.376087 -3.003702 1.666335
C  -1.434694 -0.368191 -2.355393
C  -0.216373 -1.189824 -1.844933
C  1.14736 -0.486418 -1.980931
C  1.722139 -0.395783 -0.556363
C  2.662976 0.794866 -0.378665
O  3.335677 0.692524 0.764141
C  4.183091 1.791903 1.098598
O  2.794152 1.697275 -1.160881
C  2.525364 -1.64934 -0.198774
O  3.573431 -1.77831 -1.01059
C  4.437242 -2.889597 -0.758886
O  2.270207 -2.423893 0.684729
C  0.451397 -0.313911 0.326426
C  -0.46459 -1.382349 -0.322677
C  -1.903992 -1.055215 -0.12195
C  -2.797468 -1.605841 0.816712
C  -4.137172 -1.153836 0.921313
C  -5.005639 -1.698796 1.843081
C  -4.58554 -2.712493 2.701134
C  -3.273061 -3.17242 2.620906
C  -2.394075 -2.636331 1.703635
C  -0.185996 1.06407 0.268381
N  0.466081 2.039374 0.892892
H  0.24002 5.268719 1.659357
H  1.708371 4.52899 1.007478
H  1.080799 3.991198 2.563019
H  -1.584143 4.596959 0.214906
H  -2.835031 2.773189 -0.922569
H  -2.934922 -3.956723 3.288223
H  -6.023882 -1.331528 1.898625
H  -5.271396 -3.135587 3.424706
C  -2.370976 -1.172047 -3.179512
H  -0.198589 -2.154063 -2.352313
H  1.034157 0.528904 -2.361231
H  1.825419 -1.004454 -2.656523
H  4.636863 1.535449 2.051656
H  3.588967 2.700732 1.191293
H  4.94791 1.930769 0.334999
H  3.888419 -3.826075 -0.851725
H  4.864068 -2.815815 0.240959
H  5.21842 -2.829162 -1.511209
H  0.686007 -0.547055 1.36487
H  -0.169473 -2.368641 0.025942
H  -4.486494 -0.366322 0.265581
H  -1.108074 0.506062 -2.925521
H  -3.166507 0.38242 -1.20931
H  -3.074846 -0.683811 -3.842084
H  -2.494161 -2.233508 -2.999208
elementType: C H O N
totalener: -1323.49111653533214 hartree
nucrepener: 3063.14795364389011 hartree
electener: -4386.62560819077771 hartree
oneelecener: -7893.51641959614608 hartree
twoeener: 3506.89081140536837 hartree
cpcmener: -0.01346727429608 hartree
kineticenergy: 1317.68470612061060 hartree
xcener: -128.495460623828 hartree
s2: 2.055527
energy: -524.8652 -524.7274 -523.2710 -523.1207 -392.3275 -283.5267 -283.4335 -281.1364 -281.0019 -280.9221 -280.8976 -280.8679 -280.2709 -280.1953 -280.1868 -280.1578 -280.1320 -280.1017 -280.0284 -279.9027 -279.8917 -279.8431 -279.8163 -279.7850 -279.7640 -279.7412 -279.7405 -279.7254 -279.7127 -279.4565 -33.8300 -33.5362 -31.2233 -31.0955 -29.2218 -27.7189 -26.6760 -26.1200 -25.0781 -24.8643 -24.3978 -23.9403 -23.5373 -23.2261 -23.0983 -22.5413 -22.4229 -21.7414 -20.5823 -20.4714 -19.7132 -19.6672 -19.3834 -19.0660 -18.8310 -18.1047 -18.0180 -17.6508 -17.5964 -17.1809 -16.9711 -16.4666 -16.3795 -16.2312 -15.9895 -15.8734 -15.7741 -15.6646 -15.1930 -15.0564 -14.9601 -14.7354 -14.6880 -14.4704 -14.3653 -14.2036 -14.1143 -13.9447 -13.7914 -13.7224 -13.5269 -13.4409 -13.1696 -13.0232 -13.0004 -12.8903 -12.7878 -12.7084 -12.4499 -12.4112 -12.1261 -12.0334 -11.8612 -11.6894 -11.4871 -11.3618 -11.3037 -11.0538 -11.0369 -10.6384 -10.3689 -10.1470 -10.0458 -9.5945 -9.5436 -9.1146 -8.0354 -6.8393 1.0144 1.3748 1.5246 1.5839 1.6090 1.7037 1.7634 1.9221 1.9787 2.0431 2.0703 electronvolt
energy: -524.8652 -524.7271 -523.2709 -523.1202 -392.3287 -283.5266 -283.4326 -281.1364 -281.0019 -280.9208 -280.8945 -280.8676 -280.2516 -280.1911 -280.1651 -280.1605 -280.1415 -280.0403 -279.9323 -279.9170 -279.8769 -279.8435 -279.7708 -279.7574 -279.7408 -279.7167 -279.6956 -279.6614 -279.5543 -279.4566 -33.8295 -33.5354 -31.2230 -31.0943 -29.2083 -27.5648 -26.5882 -26.0190 -25.0183 -24.8045 -24.1722 -23.8504 -23.4495 -23.1902 -23.0421 -22.5028 -22.0524 -21.6156 -20.4308 -20.1686 -19.6394 -19.4622 -19.2969 -18.9329 -18.8220 -18.0206 -17.9772 -17.5943 -17.5016 -17.1176 -16.9444 -16.3876 -16.3522 -16.1800 -15.9458 -15.8546 -15.7658 -15.5465 -15.0980 -14.9732 -14.8907 -14.6856 -14.6153 -14.4398 -14.2649 -14.1078 -13.9361 -13.9081 -13.7355 -13.6715 -13.4773 -13.3417 -12.9892 -12.9584 -12.9050 -12.8745 -12.6858 -12.6606 -12.3865 -12.3160 -12.0842 -11.9611 -11.7172 -11.5898 -11.3974 -11.2912 -11.2359 -11.0413 -10.9806 -10.6009 -10.1485 -10.1107 -9.6028 -9.5287 -9.2494 -8.9356 -0.2779 0.3485 1.0698 1.3978 1.5628 1.6033 1.6738 1.8228 1.8517 1.9844 2.0075 electronvolt
chargesum: 0.0000000
charge: -0.387808 -0.758733 0.007035 -0.124553 -1.175082 0.796945 0.287364 -0.056699 0.112333 0.578534 -0.057490 0.196939 -0.387851 -0.362809 -0.408627 -0.214505 -0.551265 -0.425023 -0.492389 1.043228 0.535844 -0.736616 -0.374582 -0.407404 -0.248274 -0.684670 -0.215914 -0.571298 0.368187 -0.606539 0.102998 0.143930 0.142720 0.638225 0.457942 0.666590 0.576234 0.794532 -0.456881 0.088105 -0.019538 0.068083 0.098687 0.217622 0.362849 0.251521 0.265949 0.184478 -0.048712 0.065804 0.296716 0.004726 0.120402 0.101451 0.197288
charge: 0.353879 -0.314109 0.131912 0.157827 -0.067604 -0.045003 -0.056409 -0.098344 0.008680 0.228980 -0.205497 -0.750707 0.275771 0.258643 0.325463 -0.728010 0.274195 0.259449 0.328150 0.029681 -0.009550 -0.034747 -0.135642 0.125366 0.075909 0.074773 0.077632 0.129485 -0.207034 0.338660 -0.073751 -0.069445 -0.065652 -0.054395 -0.038668 -0.061785 -0.062443 -0.068905 0.442553 -0.022682 -0.032351 -0.023564 -0.050058 -0.061503 -0.048262 -0.048952 -0.047451 -0.051711 -0.000160 -0.026880 -0.059764 -0.024260 -0.029076 -0.115888 -0.106743
qa: -0.3878 -0.7587 0.0070 -0.1246 -1.1751 0.7969 0.2874 -0.0567 0.1123 0.5785 -0.0575 0.1969 -0.3879 -0.3628 -0.4086 -0.2145 -0.5513 -0.4250 -0.4924 1.0432 0.5358 -0.7366 -0.3746 -0.4074 -0.2483 -0.6847 -0.2159 -0.5713 0.3682 -0.6065 0.1030 0.1439 0.1427 0.6382 0.4579 0.6666 0.5762 0.7945 -0.4569 0.0881 -0.0195 0.0681 0.0987 0.2176 0.3628 0.2515 0.2659 0.1845 -0.0487 0.0658 0.2967 0.0047 0.1204 0.1015 0.1973
va: 4.0734 4.9809 3.5185 3.8191 3.6266 1.2675 0.9909 2.7769 2.3286 3.1253 2.6563 3.4227 1.9098 3.6212 2.1521 3.4284 1.9585 3.7365 2.0749 1.2907 1.3748 2.8570 2.9545 3.4755 4.0716 4.4202 4.0455 3.6514 1.3910 2.1454 1.1270 1.0318 1.0666 0.3364 0.6765 0.3290 0.4137 0.0240 3.8753 0.8005 0.9716 1.0234 1.4534 1.4976 1.1925 1.1286 1.1390 1.4665 1.0410 0.8437 0.9521 0.8412 0.7109 1.1269 1.2275
dispersion: -0.033226115 hartree
energy: -1323.524342649911 hartree
dipole: -0.008079358 0.005702036 -0.002377322 2.235154276 -1.942714969 0.292439307 -1.421119923 1.111006453 -0.310113469
dipolemethod: SCF
magnitude: 0.426259034 au
magnitude: 1.083464360 debye
