program: Orca
programVersion: 6.0.1
elementType: C C C C C C H C C C C C O C O C O C O C C C C C C C C C C N H H H H H H H H C H H H H H H H H H H H H H H H H
charge: 0
multiplicity: 3
keywords: UKS wB97X-D3 def2-QZVPPD DEF2/J RIJCOSX DEFGRID3 CPCM(Toluene) TightSCF
formula: C25H25NO4
InChI: InChI=1/C25H25NO4/c1-15-9-10-17-13-24(18-7-5-4-6-8-18)12-11-16-14-25(22(27)29-2,23(28)30-3)20(19(16)24)21(17)26-15/h4-11,13,16,19-20H,12,14H2,1-3H3
55 atoms
C  0.936221 4.238684 1.950507
C  0.078252 3.320685 1.133784
C  -1.046503 3.788181 0.445725
C  -1.805241 2.904835 -0.277186
C  -1.445567 1.538657 -0.322756
C  -2.257982 0.577007 -0.931532
H  -2.407724 -3.491168 0.015357
C  -1.080436 -1.475819 -2.866973
C  0.063034 -1.452454 -1.921193
C  1.115767 -0.347814 -2.052504
C  1.638001 -0.233715 -0.616043
C  2.543968 0.97593 -0.415799
O  3.308272 0.828712 0.662858
C  4.159117 1.926663 0.990373
O  2.586348 1.927321 -1.149179
C  2.449665 -1.481651 -0.251656
O  3.48908 -1.622427 -1.072767
C  4.351284 -2.733422 -0.815366
O  2.197548 -2.248899 0.63891
C  0.321585 -0.214282 0.228488
C  -0.566417 -1.245023 -0.514496
C  -2.063783 -0.894889 -0.758482
C  -2.957893 -1.439138 0.364195
C  -3.728521 -0.608108 1.1698
C  -4.525568 -1.126102 2.183936
C  -4.56469 -2.490044 2.41485
C  -3.795274 -3.333069 1.623373
C  -3.004309 -2.811998 0.614236
C  -0.246495 1.18076 0.33837
N  0.455012 2.042893 1.057708
H  0.385733 5.124484 2.267375
H  1.795331 4.571381 1.360815
H  1.318352 3.718956 2.82895
H  -1.31635 4.835692 0.501454
H  -2.698172 3.234575 -0.79694
H  -3.210899 -1.106058 -2.632377
H  -3.809976 -4.403187 1.794214
H  -5.185218 -2.895692 3.204899
C  -2.362772 -1.57397 -2.125379
H  0.590046 -2.417643 -1.945706
H  0.657431 0.60298 -2.330183
H  1.900806 -0.569647 -2.773105
H  4.705336 1.622843 1.878893
H  3.558592 2.811763 1.197559
H  4.847189 2.134023 0.171333
H  3.798079 -3.668897 -0.891723
H  4.787212 -2.649409 0.179766
H  5.126072 -2.685404 -1.575201
H  0.549853 -0.552631 1.23859
H  -0.523443 -2.180243 0.040163
H  -3.708621 0.463409 1.013834
H  -5.116631 -0.454113 2.795223
H  -0.981085 -1.595532 -3.937681
H  -2.641577 -2.625846 -1.970662
H  -3.152376 0.909809 -1.448589
elementType: C H O N
totalener: -1323.49265680254075 hartree
nucrepener: 3077.29893303318249 hartree
electener: -4400.77811015277985 hartree
oneelecener: -7922.14850774224033 hartree
twoeener: 3521.37039758946003 hartree
cpcmener: -0.01348720512933 hartree
kineticenergy: 1317.68482883874640 hartree
xcener: -128.499441184340 hartree
s2: 2.055606
energy: -524.8388 -524.7041 -523.2308 -523.0784 -392.3034 -283.4797 -283.4035 -281.1162 -280.9904 -280.9625 -280.9063 -280.8566 -280.4324 -280.2044 -280.1816 -280.0958 -280.0957 -279.9846 -279.8933 -279.8517 -279.8054 -279.7701 -279.7503 -279.7467 -279.7442 -279.7286 -279.7281 -279.7044 -279.6903 -279.4559 -33.7995 -33.5050 -31.1878 -31.0605 -29.1901 -27.5135 -26.7091 -26.0142 -25.4609 -24.9812 -24.2124 -23.6417 -23.5199 -23.2053 -23.1249 -22.7558 -22.1710 -21.9202 -20.5428 -20.3546 -19.6891 -19.6459 -19.2048 -19.0743 -18.8853 -18.1956 -17.9927 -17.5863 -17.3090 -17.2428 -16.7494 -16.5375 -16.3816 -16.3239 -16.1015 -15.9016 -15.7589 -15.5643 -15.2177 -15.0443 -14.9085 -14.7872 -14.6415 -14.5507 -14.4170 -14.1001 -14.0753 -13.9708 -13.7439 -13.6476 -13.4437 -13.3037 -13.1921 -13.0946 -12.9801 -12.8921 -12.7986 -12.6598 -12.5513 -12.2322 -12.1427 -11.8966 -11.8542 -11.8103 -11.5763 -11.3913 -11.2443 -11.0907 -11.0145 -10.7216 -10.5511 -10.0795 -9.8439 -9.5287 -9.3166 -9.0085 -7.5750 -7.0252 0.9502 1.3859 1.5565 1.6033 1.6293 1.7149 1.7907 1.9216 1.9944 2.0529 2.1221 electronvolt
energy: -524.8380 -524.7039 -523.2292 -523.0788 -392.3538 -283.4798 -283.4032 -281.1162 -280.9903 -280.8906 -280.8508 -280.8333 -280.4422 -280.2094 -280.1546 -280.1178 -280.0772 -279.8894 -279.8700 -279.8427 -279.7848 -279.7686 -279.7461 -279.7388 -279.7293 -279.7270 -279.7046 -279.6881 -279.4796 -279.4605 -33.7978 -33.5043 -31.1846 -31.0608 -29.1392 -27.3902 -26.6814 -25.8731 -25.2843 -24.8675 -24.1046 -23.5049 -23.4902 -23.1639 -23.0209 -22.6300 -22.1336 -21.6790 -20.4699 -20.0753 -19.5832 -19.5584 -19.0878 -19.0020 -18.8403 -17.9832 -17.9583 -17.4777 -17.2154 -17.1401 -16.6493 -16.4540 -16.3487 -16.2620 -16.0511 -15.8857 -15.7485 -15.4725 -15.1462 -14.9503 -14.8206 -14.6786 -14.5006 -14.4162 -14.3322 -14.0639 -13.9815 -13.8915 -13.6799 -13.6057 -13.3684 -13.2014 -13.0895 -12.9840 -12.8798 -12.7701 -12.7239 -12.5882 -12.5102 -12.1327 -12.0730 -11.7892 -11.7458 -11.6944 -11.4997 -11.3158 -11.1223 -11.0060 -11.0004 -10.6333 -10.3062 -10.0714 -9.5663 -9.4019 -9.2948 -8.9838 -0.3797 0.7301 1.2376 1.4169 1.5890 1.6220 1.6902 1.7408 1.8518 1.9466 2.0257 electronvolt
chargesum: -0.0000000
charge: -0.440493 -0.534831 0.164425 -0.064500 -0.557442 -0.107418 0.167783 -0.055212 -0.146597 0.210884 0.109313 0.291974 -0.418166 -0.459035 -0.398795 0.045284 -0.512620 -0.442363 -0.470199 1.076010 0.929272 -0.467915 -0.747097 -0.426758 -0.306846 -0.741066 -0.538167 -0.194628 -0.109048 -0.582128 0.092249 0.194063 0.206646 0.603647 0.351986 -0.020550 0.520442 0.810257 0.482869 0.149658 -0.042749 0.025619 0.168751 0.178405 0.376314 0.225012 0.274020 0.196788 -0.007591 -0.126254 0.226035 0.553686 0.176773 -0.043434 0.153738
charge: 0.349989 -0.309413 0.124327 0.152743 -0.137438 0.178206 -0.049412 0.236036 -0.067957 0.207847 -0.207929 -0.750603 0.275457 0.258911 0.328119 -0.741409 0.275773 0.259656 0.333018 0.037362 0.022140 -0.276264 -0.105379 0.123393 0.089043 0.072563 0.089959 0.102562 -0.209190 0.330359 -0.072420 -0.068722 -0.066163 -0.052782 -0.044022 -0.031553 -0.061387 -0.065167 0.137249 -0.009701 -0.017673 -0.019805 -0.049317 -0.064965 -0.047672 -0.049101 -0.047190 -0.051693 -0.008384 -0.025446 -0.057098 -0.061864 -0.078705 -0.037800 -0.041087
qa: -0.4405 -0.5348 0.1644 -0.0645 -0.5574 -0.1074 0.1678 -0.0552 -0.1466 0.2109 0.1093 0.2920 -0.4182 -0.4590 -0.3988 0.0453 -0.5126 -0.4424 -0.4702 1.0760 0.9293 -0.4679 -0.7471 -0.4268 -0.3068 -0.7411 -0.5382 -0.1946 -0.1090 -0.5821 0.0922 0.1941 0.2066 0.6036 0.3520 -0.0206 0.5204 0.8103 0.4829 0.1497 -0.0427 0.0256 0.1688 0.1784 0.3763 0.2250 0.2740 0.1968 -0.0076 -0.1263 0.2260 0.5537 0.1768 -0.0434 0.1537
va: 3.9938 4.7486 3.2926 3.5899 3.6992 2.1488 1.0184 3.8575 2.9689 3.1873 2.4382 3.1776 1.8815 3.6917 2.1330 3.7128 1.8966 3.6965 2.0870 0.9488 -0.0958 2.6745 3.0973 3.8832 3.9938 4.4150 4.4020 3.8381 2.3379 2.0352 1.2079 1.0337 0.9273 0.2756 0.7194 1.0758 0.6293 -0.0039 3.3506 0.7585 1.0390 1.0797 1.4830 1.4227 1.1940 1.1897 1.1445 1.5092 0.8911 1.0977 1.0212 0.6012 0.9114 1.1229 0.8956
dispersion: -0.034335664 hartree
energy: -1323.526992466255 hartree
dipole: 0.816414361 -0.850203635 -0.033789273 0.361399246 -0.369064788 -0.007665542 0.438836471 -0.721914483 -0.283078012
dipolemethod: SCF
magnitude: 0.285190527 au
magnitude: 0.724896710 debye
