program: Orca
programVersion: 6.0.1
elementType: C C C C C C C C C C C C O C O C O C O C C C C C C C C C C N H H H H H H H H H H H H H H H H H H H H C H H H H F F F
charge: 0
multiplicity: 1
keywords: UKS wB97X-D3 def2-QZVPPD DEF2/J RIJCOSX DEFGRID3 CPCM(Toluene) TightSCF
formula: C26H24F3NO4
InChI: InChI=1/C26H24F3NO4/c1-5-6-13-25(23(31)33-3,24(32)34-4)21-15-18(14-17-12-11-16(2)30-22(17)21)19-9-7-8-10-20(19)26(27,28)29/h5-12,14-15,21H,1,13H2,2-4H3
58 atoms
C  1.73911 4.87586 0.399558
C  0.712979 3.798069 0.212785
C  -0.583109 4.076846 -0.206331
C  -1.474839 3.0345 -0.364824
C  -1.062709 1.729978 -0.1199
C  -1.982685 0.59186 -0.210889
C  -1.669375 0.059725 -2.37547
C  -1.066509 -1.179583 -2.290937
C  0.170482 -1.406765 -1.699036
C  1.317211 -0.439267 -1.78407
C  1.958138 -0.215941 -0.415788
C  3.047055 0.858925 -0.497941
O  3.742002 0.913587 0.634446
C  4.739449 1.932621 0.710565
O  3.280684 1.525219 -1.469607
C  2.66116 -1.484521 0.084092
O  3.555594 -1.905885 -0.807774
C  4.321981 -3.056082 -0.439012
O  2.462841 -2.032011 1.135498
C  0.802017 0.154613 0.548059
C  -0.263296 -0.916365 0.461639
C  -1.612304 -0.59501 0.412277
C  -2.623696 -1.647997 0.687143
C  -3.78913 -1.432728 1.442046
C  -4.71526 -2.454161 1.615767
C  -4.503128 -3.707903 1.069586
C  -3.336815 -3.950223 0.365911
C  -2.41468 -2.933314 0.185517
C  0.261047 1.541848 0.27783
N  1.10679 2.548858 0.455125
H  1.302938 5.868348 0.291645
H  2.533064 4.762303 -0.342223
H  2.196795 4.794976 1.386625
H  -0.885115 5.099311 -0.395551
H  -2.497899 3.226397 -0.670292
H  -3.030277 0.839423 -0.311632
H  -1.078038 0.961082 -2.463707
H  -2.673486 0.128927 -2.77698
H  -1.711065 -2.044462 -2.417453
H  0.467906 -2.448231 -1.595147
H  0.989944 0.528845 -2.162282
H  2.062291 -0.816184 -2.485988
H  5.192134 1.830884 1.692778
H  4.273297 2.912128 0.605114
H  5.485945 1.794741 -0.071059
H  3.665829 -3.908832 -0.26861
H  4.895684 -2.851789 0.464408
H  4.986199 -3.247591 -1.276797
H  1.210576 0.152666 1.562585
H  0.014633 -1.855241 0.923842
C  -4.086197 -0.124856 2.142234
H  -5.60526 -2.27118 2.202258
H  -5.236442 -4.491164 1.21455
H  -3.140736 -4.932064 -0.047958
H  -1.506634 -3.13588 -0.365174
F  -2.995634 0.464706 2.646952
F  -4.680477 0.774687 1.328622
F  -4.930981 -0.296701 3.172976
elementType: C O N H F
totalener: -1660.61743616674016 hartree
nucrepener: 3851.97442047793220 hartree
electener: -5512.57832969049923 hartree
oneelecener: -9937.28154757059929 hartree
twoeener: 4424.70321788010006 hartree
cpcmener: -0.01353429408164 hartree
kineticenergy: 1653.82373383106824 hartree
xcener: -154.501326820260 hartree
s2: 0.000000
energy: -675.3319 -675.3216 -675.2951 -524.9430 -524.7317 -523.3299 -523.1118 -392.3523 -286.7039 -283.5961 -283.4569 -281.1832 -281.0082 -280.9792 -280.9333 -280.9080 -280.7132 -280.6797 -280.4083 -280.2630 -280.2211 -280.1946 -280.1735 -280.1621 -280.1616 -280.1611 -280.0866 -280.0820 -280.0251 -279.8917 -279.8561 -279.8256 -279.5324 -279.4639 -39.1006 -36.6019 -36.5381 -33.8859 -33.5607 -31.2945 -31.1012 -29.2463 -27.4677 -26.9224 -26.0391 -25.1449 -25.0498 -24.7480 -24.5688 -23.7697 -23.4656 -23.1981 -22.7646 -22.5146 -22.1751 -21.8093 -20.5570 -20.4261 -20.2668 -20.0321 -19.7154 -19.5248 -19.1116 -18.9195 -18.8774 -18.4417 -18.1025 -17.9027 -17.3299 -17.0839 -16.9649 -16.9334 -16.5245 -16.3547 -16.2396 -16.0083 -15.9618 -15.9130 -15.8627 -15.8006 -15.7755 -15.4615 -15.2682 -15.0290 -14.9607 -14.8003 -14.6484 -14.5565 -14.4037 -14.3032 -14.1165 -14.0517 -13.9175 -13.8676 -13.7829 -13.7188 -13.6591 -13.4687 -13.2467 -13.1993 -13.0689 -12.9339 -12.8866 -12.7537 -12.6726 -12.5679 -12.3572 -12.2710 -12.1954 -12.0992 -11.8190 -11.6503 -11.2538 -11.0652 -10.7368 -10.2948 -10.1677 -9.8885 -9.7416 -9.6236 -9.5492 -8.4400 -7.8638 0.3845 0.9349 1.0404 1.2542 1.3538 1.5387 1.5627 1.7795 1.8364 1.8583 1.9221 electronvolt
chargesum: -0.0000000
charge: -0.481052 -0.581574 -0.031470 -0.071445 -0.640626 0.114243 -0.050189 -0.150484 -0.245281 0.415936 1.018256 -0.079231 -0.409977 -0.324470 -0.393531 -0.164242 -0.516392 -0.369890 -0.467879 1.335982 -0.578230 -0.460179 0.239555 -0.610435 -0.031047 -0.714701 -0.293964 -0.465402 0.116151 -0.455017 0.195759 0.216534 0.163512 0.503326 0.296522 0.064137 -0.037533 0.106023 0.173000 0.323100 0.046127 0.035876 0.143703 0.121965 0.356610 0.259756 0.263704 0.134579 -0.117500 0.041265 0.825750 0.444382 0.958917 0.779238 0.080067 -0.303794 -0.362414 -0.366025
charge: 0.354464 -0.308643 0.133632 0.153651 -0.128276 0.093237 0.319509 0.017712 0.089292 0.156388 -0.217188 -0.756962 0.274605 0.259120 0.326439 -0.736523 0.277043 0.262834 0.329145 -0.007205 0.148010 -0.170930 -0.073999 -0.062388 0.129207 0.104632 0.113896 0.127023 -0.214078 0.339900 -0.073496 -0.067410 -0.065728 -0.053796 -0.036339 -0.049862 -0.085831 -0.072723 -0.061506 -0.041061 -0.027943 -0.018007 -0.050140 -0.061170 -0.048453 -0.048814 -0.046866 -0.051080 0.000841 -0.040273 -1.112112 -0.047346 -0.057210 -0.053873 -0.058361 0.349316 0.322465 0.323230
qa: -0.4811 -0.5816 -0.0315 -0.0714 -0.6406 0.1142 -0.0502 -0.1505 -0.2453 0.4159 1.0183 -0.0792 -0.4100 -0.3245 -0.3935 -0.1642 -0.5164 -0.3699 -0.4679 1.3360 -0.5782 -0.4602 0.2396 -0.6104 -0.0310 -0.7147 -0.2940 -0.4654 0.1162 -0.4550 0.1958 0.2165 0.1635 0.5033 0.2965 0.0641 -0.0375 0.1060 0.1730 0.3231 0.0461 0.0359 0.1437 0.1220 0.3566 0.2598 0.2637 0.1346 -0.1175 0.0413 0.8257 0.4444 0.9589 0.7792 0.0801 -0.3038 -0.3624 -0.3660
va: 4.0943 4.9073 3.4535 3.6009 3.6843 3.1455 3.6905 3.4760 2.9125 2.4928 0.9518 3.0812 1.9115 3.7102 2.1538 3.8522 1.9062 3.6994 2.1079 0.9858 2.4068 2.0864 1.9368 2.6550 3.6528 4.4897 3.9644 3.7857 2.0054 2.1668 1.0516 0.9720 1.0572 0.6294 0.7548 0.9620 1.0835 0.9818 0.7826 0.5428 0.7736 0.9955 1.4223 1.4275 1.2029 1.1594 1.1107 1.5320 0.9810 0.7483 3.1803 0.8240 -0.3016 0.2430 1.0653 0.9245 0.9215 0.9219
dispersion: -0.039083488 hartree
energy: -1660.656519654807 hartree
dipole: 29.982913755 -29.824385356 0.158528399 0.135854280 -0.907312061 -0.771457781 -18.911201893 18.280250129 -0.630951763
dipolemethod: SCF
magnitude: 1.009147407 au
magnitude: 2.565048861 debye
