program: Orca
programVersion: 6.0.1
elementType: C C C C C C C C C C C C O C O C O C O C C C C C C C C C C N H H H H H H H H H H H H H H H H H H H H C H C H H F F F F F F
charge: 0
multiplicity: 1
keywords: UKS wB97X-D3 def2-QZVPPD DEF2/J RIJCOSX DEFGRID3 CPCM(Toluene) TightSCF
formula: C27H23F6NO4
InChI: InChI=1/C27H23F6NO4/c1-5-6-11-25(23(35)37-3,24(36)38-4)21-13-17(12-16-8-7-15(2)34-22(16)21)19-10-9-18(26(28,29)30)14-20(19)27(31,32)33/h5-10,12-14,21H,1,11H2,2-4H3
61 atoms
C  2.010825 5.144144 0.28677
C  0.988009 4.061579 0.111259
C  -0.310489 4.332717 -0.30594
C  -1.199164 3.286297 -0.452893
C  -0.781328 1.985353 -0.198697
C  -1.698483 0.843629 -0.274863
C  -1.395573 0.295504 -2.435491
C  -0.786665 -0.940476 -2.343626
C  0.455225 -1.158037 -1.758687
C  1.597555 -0.186646 -1.857337
C  2.245121 0.048286 -0.494125
C  3.329465 1.126883 -0.589201
O  4.029611 1.191314 0.539078
C  5.024649 2.213809 0.603755
O  3.554625 1.787627 -1.56654
C  2.954926 -1.214719 0.0104
O  3.84982 -1.635505 -0.880521
C  4.622816 -2.780478 -0.50813
O  2.759158 -1.75851 1.064303
C  1.092751 0.421301 0.473003
C  0.031501 -0.654603 0.399061
C  -1.31836 -0.335737 0.356817
C  -2.322848 -1.389386 0.645868
C  -3.484976 -1.172205 1.402314
C  -4.409511 -2.191771 1.586903
C  -4.190624 -3.444192 1.046285
C  -3.02349 -3.695963 0.343644
C  -2.108671 -2.679678 0.155158
C  0.544425 1.804414 0.19525
N  1.387049 2.815663 0.361843
H  1.570446 6.134411 0.176037
H  2.80113 5.029495 -0.458723
H  2.474035 5.069809 1.27171
H  -0.616489 5.352584 -0.502266
H  -2.223898 3.472291 -0.756359
H  -2.747565 1.086603 -0.371216
H  -0.808087 1.198152 -2.535009
H  -2.402017 0.356791 -2.832354
H  -1.427782 -1.809296 -2.461543
H  0.75758 -2.19753 -1.64925
H  1.264654 0.777427 -2.240848
H  2.339784 -0.566436 -2.560675
H  5.482256 2.119464 1.584382
H  4.555196 3.191282 0.494345
H  5.767688 2.072841 -0.180564
H  3.971051 -3.634835 -0.329423
H  5.199721 -2.567787 0.391279
H  5.283959 -2.97423 -1.347771
H  1.505874 0.427587 1.485613
H  0.315921 -1.589163 0.866111
C  -3.786605 0.140278 2.09607
H  -5.299943 -2.007748 2.170689
C  -5.179276 -4.557197 1.257177
H  -2.830003 -4.681172 -0.06279
H  -1.202413 -2.885814 -0.396105
F  -2.696016 0.734689 2.590696
F  -4.388193 1.027747 1.277753
F  -4.625151 -0.033804 3.12987
F  -6.354709 -4.119441 1.72412
F  -5.427813 -5.221564 0.116443
F  -4.720686 -5.466049 2.13694
elementType: C O N H F
totalener: -1997.74813581507419 hartree
nucrepener: 4584.38768142375102 hartree
electener: -6582.12192702199354 hartree
twoeener: 5284.77372432300035 hartree
cpcmener: -0.01390417132593 hartree
kineticenergy: 1989.94224014667179 hartree
xcener: -180.555212170978 hartree
s2: 0.000000
energy: -675.5675 -675.4932 -675.4885 -675.4846 -675.4597 -675.4344 -524.9992 -524.7855 -523.3903 -523.1674 -392.4239 -286.8996 -286.8615 -283.6580 -283.5144 -281.2272 -281.0553 -281.0527 -281.0524 -281.0377 -281.0193 -280.9825 -280.9007 -280.7475 -280.6544 -280.5015 -280.4206 -280.3690 -280.3176 -280.2763 -280.2684 -280.2504 -280.1762 -279.9725 -279.9300 -279.9257 -279.6512 -279.5140 -39.2801 -39.2718 -36.8200 -36.7771 -36.7147 -36.6987 -33.9443 -33.6162 -31.3544 -31.1579 -29.3248 -27.9116 -27.1070 -26.2378 -25.5261 -25.2047 -25.1045 -24.8021 -24.2329 -23.6474 -23.2574 -22.9083 -22.8062 -22.6904 -22.1959 -21.8682 -20.8010 -20.7370 -20.4742 -20.2767 -19.8663 -19.6621 -19.4659 -19.3002 -19.2837 -19.2674 -19.0157 -18.9393 -18.2730 -17.9830 -17.6323 -17.4646 -17.2262 -17.0767 -17.0373 -16.5889 -16.4800 -16.3004 -16.2363 -16.0561 -15.9749 -15.9538 -15.9472 -15.9041 -15.8570 -15.7821 -15.6692 -15.3585 -15.1015 -14.9393 -14.8683 -14.8326 -14.7324 -14.6598 -14.6506 -14.5522 -14.3737 -14.2481 -14.2280 -14.1891 -14.0595 -13.9507 -13.9228 -13.8036 -13.7361 -13.5579 -13.4452 -13.3100 -13.1599 -13.0170 -12.9962 -12.9054 -12.7515 -12.6563 -12.6039 -12.4003 -12.3309 -12.2438 -11.9347 -11.8089 -11.3114 -11.1186 -10.8034 -10.4023 -10.2442 -10.2367 -10.0603 -9.7206 -9.6523 -8.6083 -7.9785 0.0771 0.7264 0.9262 0.9639 1.2987 1.4849 1.5062 1.6001 1.7638 1.7809 1.8432 electronvolt
chargesum: 0.0000000
charge: -0.431582 -0.678897 0.002455 -0.061172 -0.563780 0.112609 -0.050541 -0.128834 -0.300649 0.480410 0.855764 -0.015631 -0.392793 -0.249147 -0.377204 -0.087374 -0.515256 -0.352166 -0.472742 1.245462 -0.508487 -0.383838 0.182482 -0.377090 0.359358 -0.342347 0.062335 -0.236357 0.193525 -0.461990 0.169399 0.222864 0.169828 0.534782 0.276363 0.120976 -0.048179 0.119847 0.176157 0.326236 0.036980 0.023901 0.088038 0.104951 0.373198 0.246816 0.211105 0.176649 -0.117144 0.047496 0.831259 0.166814 0.860212 0.329464 0.133772 -0.308391 -0.363263 -0.370009 -0.358633 -0.340303 -0.347704
charge: 0.355281 -0.307426 0.134887 0.154364 -0.128089 0.094800 0.321488 0.019805 0.090530 0.157472 -0.216976 -0.757272 0.274951 0.260045 0.327074 -0.736935 0.277611 0.263984 0.329267 -0.006269 0.149051 -0.169811 -0.058441 -0.036234 0.180759 -0.094098 0.165390 0.156099 -0.213900 0.340496 -0.073202 -0.067018 -0.065451 -0.053323 -0.035926 -0.049069 -0.085083 -0.071932 -0.060403 -0.040333 -0.027618 -0.017435 -0.050009 -0.061024 -0.048253 -0.048782 -0.046633 -0.050873 0.001363 -0.039700 -1.110898 -0.034759 -1.129378 -0.031591 -0.052746 0.354741 0.329000 0.331003 0.337081 0.334073 0.336277
qa: -0.4316 -0.6789 0.0025 -0.0612 -0.5638 0.1126 -0.0505 -0.1288 -0.3006 0.4804 0.8558 -0.0156 -0.3928 -0.2491 -0.3772 -0.0874 -0.5153 -0.3522 -0.4727 1.2455 -0.5085 -0.3838 0.1825 -0.3771 0.3594 -0.3423 0.0623 -0.2364 0.1935 -0.4620 0.1694 0.2229 0.1698 0.5348 0.2764 0.1210 -0.0482 0.1198 0.1762 0.3262 0.0370 0.0239 0.0880 0.1050 0.3732 0.2468 0.2111 0.1766 -0.1171 0.0475 0.8313 0.1668 0.8602 0.3295 0.1338 -0.3084 -0.3633 -0.3700 -0.3586 -0.3403 -0.3477
va: 4.0788 5.0287 3.4274 3.5748 3.4669 2.8578 3.6813 3.4370 3.0666 2.3287 1.3027 3.1000 1.9447 3.6786 2.1556 3.7905 1.8784 3.6870 2.1088 1.1603 2.1916 1.4718 2.2870 1.9108 2.5491 2.6227 3.4447 3.5652 1.8838 2.1547 1.0242 0.9686 1.0519 0.5629 0.7868 0.8708 1.0995 0.9248 0.7776 0.5206 0.7735 1.0129 1.4075 1.4499 1.1714 1.1776 1.1645 1.4934 0.9924 0.7698 3.2006 0.9669 3.2702 0.8166 1.0033 0.9506 0.9239 0.9303 0.9444 0.9067 0.9170
dispersion: -0.041168362 hartree
energy: -1997.789304176619 hartree
dipole: 60.512892910 -59.419859137 1.093033773 29.135917951 -28.838696449 0.297221503 -25.359530873 24.511277756 -0.848253117
dipolemethod: SCF
magnitude: 1.415131372 au
magnitude: 3.596978091 debye
