program: Orca
programVersion: 6.0.1
elementType: C C C C C C H C C C C C O C O C O C O C C C C C C C C C C N H H H H H H H H C H H H H H H H H H H H H H H H H
charge: 0
multiplicity: 3
keywords: UKS wB97X-D3 def2-QZVPPD DEF2/J RIJCOSX DEFGRID3 CPCM(Toluene) TightSCF
formula: C25H25NO4
InChI: InChI=1/C25H25NO4/c1-5-16-14-25(23(27)29-3,24(28)30-4)21-20(16)19(17-9-7-6-8-10-17)13-18-12-11-15(2)26-22(18)21/h5-13,16,20-21H,1,14H2,2-4H3
55 atoms
C  1.194678 4.602012 1.219969
C  0.259889 3.554207 0.694843
C  -0.975715 3.87748 0.140241
C  -1.789931 2.864808 -0.319357
C  -1.36808 1.536377 -0.230088
C  -2.186818 0.42293 -0.666056
H  -1.268224 -3.127809 1.356756
C  -1.307415 -0.251418 -2.498077
C  -0.172894 -1.002416 -1.812558
C  1.193925 -0.302721 -1.950529
C  1.777079 -0.220289 -0.530451
C  2.779005 0.923778 -0.37704
O  3.432931 0.817333 0.776708
C  4.351905 1.865932 1.08139
O  2.984682 1.779669 -1.194604
C  2.536193 -1.499859 -0.161107
O  3.559394 -1.690975 -0.991747
C  4.386198 -2.826989 -0.72553
O  2.27249 -2.240848 0.748315
C  0.512162 -0.087776 0.356086
C  -0.424369 -1.142642 -0.280934
C  -1.853629 -0.853079 -0.001778
C  -2.706242 -1.581859 0.848831
C  -4.04159 -1.163048 1.09281
C  -4.880943 -1.886319 1.912773
C  -4.440199 -3.056073 2.52775
C  -3.132249 -3.48661 2.311223
C  -2.280641 -2.772267 1.497638
C  -0.083816 1.309025 0.301951
N  0.678321 2.289882 0.763628
H  0.731389 5.588069 1.223074
H  2.093064 4.64262 0.599467
H  1.507007 4.353783 2.235535
H  -1.291788 4.911768 0.085166
H  -2.765704 3.087921 -0.737324
H  -3.20339 0.65061 -0.958113
H  -3.035106 -0.407248 -3.752866
H  -2.430338 -1.998389 -3.023006
C  -2.298318 -0.93029 -3.155888
H  -0.131161 -2.002946 -2.244462
H  1.074489 0.716886 -2.318265
H  1.865573 -0.811607 -2.639101
H  4.792553 1.603137 2.038933
H  3.818548 2.813448 1.154852
H  5.120464 1.937469 0.312399
H  3.799423 -3.743558 -0.774423
H  4.840313 -2.738586 0.261041
H  5.14985 -2.821702 -1.497895
H  0.745203 -0.331297 1.393165
H  -0.108711 -2.123512 0.062211
H  -4.408762 -0.257681 0.62647
H  -5.894268 -1.538773 2.077936
H  -5.10421 -3.62432 3.167262
H  -2.775554 -4.392092 2.788344
H  -1.096663 0.765856 -2.815566
elementType: C H O N
totalener: -1323.45725803408573 hartree
nucrepener: 3047.01967303971151 hartree
electener: -4370.46353206518688 hartree
oneelecener: -7861.14880504912162 hartree
twoeener: 3490.68527298393428 hartree
cpcmener: -0.01340522865381 hartree
kineticenergy: 1317.66725099587438 hartree
xcener: -128.462549402973 hartree
s2: 2.111356
energy: -524.8809 -524.7056 -523.2813 -523.0942 -392.3469 -283.5430 -283.4330 -281.1434 -281.0010 -280.9974 -280.9397 -280.8817 -280.3359 -280.2925 -280.2337 -280.2321 -280.1832 -280.1296 -280.1062 -280.0046 -279.9508 -279.8641 -279.7896 -279.7788 -279.7762 -279.7494 -279.7296 -279.7163 -279.5116 -279.4754 -33.8395 -33.5234 -31.2365 -31.0770 -29.2523 -27.5080 -26.6957 -25.9892 -25.0905 -24.9698 -24.4614 -23.8446 -23.5519 -23.2722 -23.1471 -22.6720 -22.4965 -21.7698 -20.5490 -20.3999 -19.7157 -19.6710 -19.2958 -19.0593 -18.8127 -18.2305 -18.0301 -17.6275 -17.4841 -17.1756 -17.0078 -16.4459 -16.4385 -16.2155 -15.9948 -15.8837 -15.7810 -15.5608 -15.2308 -15.0702 -14.9699 -14.7738 -14.6726 -14.5320 -14.4014 -14.2852 -14.1427 -14.0090 -13.7542 -13.7340 -13.5841 -13.4522 -13.2354 -13.1125 -12.9355 -12.9232 -12.8621 -12.7558 -12.5420 -12.4076 -12.1730 -12.1262 -11.9317 -11.7785 -11.5827 -11.3031 -11.2461 -11.0408 -10.9162 -10.6598 -10.3480 -10.1681 -10.0670 -9.5949 -9.5598 -9.3046 -7.4801 -6.2558 0.9502 1.3391 1.4169 1.5768 1.5955 1.6718 1.7946 1.9151 1.9631 2.0428 2.0776 electronvolt
energy: -524.8807 -524.7053 -523.2813 -523.0941 -392.3745 -283.5431 -283.4323 -281.1434 -280.9974 -280.9635 -280.9009 -280.8789 -280.2775 -280.2125 -280.1921 -280.1799 -280.1680 -280.1644 -280.0505 -279.9872 -279.9673 -279.8843 -279.7799 -279.7749 -279.7605 -279.7179 -279.7062 -279.6690 -279.4779 -279.3704 -33.8389 -33.5227 -31.2361 -31.0765 -29.2201 -27.3491 -26.5924 -25.7948 -25.0086 -24.8943 -24.2813 -23.7347 -23.4598 -23.1604 -23.0903 -22.5534 -22.3450 -21.5715 -20.4785 -20.0925 -19.6241 -19.5553 -19.2031 -18.9494 -18.7874 -18.0987 -18.0087 -17.5855 -17.3986 -17.0763 -16.9622 -16.4180 -16.3586 -16.1767 -15.9373 -15.8577 -15.7708 -15.4414 -15.1819 -14.9950 -14.8243 -14.7001 -14.5914 -14.4583 -14.3437 -14.1450 -14.0474 -13.8550 -13.7270 -13.6908 -13.5045 -13.2924 -13.0932 -12.9712 -12.9052 -12.8604 -12.7581 -12.5835 -12.5015 -12.3312 -12.1147 -12.0596 -11.8416 -11.6937 -11.5455 -11.2787 -11.0856 -11.0355 -10.6741 -10.5182 -10.1279 -9.9164 -9.6024 -9.5041 -9.2527 -8.7071 -0.9469 0.1885 1.1331 1.3906 1.5607 1.6111 1.7297 1.8368 1.8840 1.9643 1.9858 electronvolt
chargesum: -0.0000000
charge: -0.422874 -0.774058 0.102410 -0.143959 -0.573942 0.009322 0.335432 -0.745754 0.225416 0.484868 0.423392 0.116449 -0.382037 -0.285093 -0.414441 -0.233811 -0.565524 -0.412277 -0.486852 0.976646 0.423906 -0.911686 -0.316612 -0.447109 -0.199475 -0.717817 -0.156089 -0.564450 -0.074011 -0.528440 0.125552 0.189944 0.166939 0.715099 0.509947 0.163943 0.107931 0.216631 -0.219508 0.176474 0.032764 0.089902 0.148075 0.113171 0.359943 0.285598 0.273310 0.114115 0.002074 0.110864 0.333434 0.668690 0.713870 0.622651 0.237055
charge: 0.353722 -0.309149 0.128693 0.155523 -0.116944 0.108653 -0.059823 0.006179 -0.024187 0.222805 -0.205616 -0.754929 0.274483 0.258113 0.323812 -0.728415 0.275412 0.260360 0.327395 0.029162 -0.025112 -0.069592 -0.136145 0.123584 0.075146 0.075771 0.077247 0.129653 -0.199509 0.336230 -0.073342 -0.069496 -0.064511 -0.054071 -0.040875 -0.049262 -0.105457 -0.096023 0.360064 -0.018858 -0.030999 -0.022204 -0.049994 -0.062695 -0.048343 -0.048945 -0.047173 -0.051576 0.000663 -0.037723 -0.061617 -0.062390 -0.069114 -0.061578 -0.047002
qa: -0.4229 -0.7741 0.1024 -0.1440 -0.5739 0.0093 0.3354 -0.7458 0.2254 0.4849 0.4234 0.1164 -0.3820 -0.2851 -0.4144 -0.2338 -0.5655 -0.4123 -0.4869 0.9766 0.4239 -0.9117 -0.3166 -0.4471 -0.1995 -0.7178 -0.1561 -0.5644 -0.0740 -0.5284 0.1256 0.1899 0.1669 0.7151 0.5099 0.1639 0.1079 0.2166 -0.2195 0.1765 0.0328 0.0899 0.1481 0.1132 0.3599 0.2856 0.2733 0.1141 0.0021 0.1109 0.3334 0.6687 0.7139 0.6227 0.2371
va: 4.0884 5.2167 3.2805 3.6143 3.3489 2.9793 0.9519 4.0835 1.9203 3.0766 1.7441 3.2427 1.8427 3.6467 2.1565 3.4056 2.0217 3.7720 2.0874 1.4748 1.2415 2.9272 3.3397 3.5530 3.9046 4.4696 3.9743 3.6082 1.5764 2.1194 1.0662 0.9970 1.0314 0.1342 0.5719 0.7130 1.1822 1.1484 3.8873 0.7854 0.8868 0.9990 1.3594 1.5319 1.2175 1.1024 1.0976 1.5375 0.8924 0.7590 0.9420 0.2963 0.1942 0.3716 0.6232
dispersion: -0.033457807 hartree
energy: -1323.490715841125 hartree
dipole: 0.455417104 -0.452880212 0.002536892 1.856455552 -1.557605201 0.298850351 -2.117957452 1.935042864 -0.182914588
dipolemethod: SCF
magnitude: 0.350393657 au
magnitude: 0.890629896 debye
