program: Orca
programVersion: 6.0.1
elementType: C C C C C C H C C C C C O C O C O C O C C C C C C C C C C N H H H H H H H H C H H H H H H H H H H H H H H H H
charge: 0
multiplicity: 3
keywords: UKS wB97X-D3 def2-QZVPPD DEF2/J RIJCOSX DEFGRID3 CPCM(Toluene) TightSCF
formula: C25H25NO4
InChI: InChI=1/C25H25NO4/c1-5-16-14-25(23(27)29-3,24(28)30-4)21-20(16)19(17-9-7-6-8-10-17)13-18-12-11-15(2)26-22(18)21/h5-13,16,20-21H,1,14H2,2-4H3
55 atoms
C  1.38443 4.679385 0.669422
C  0.334058 3.630257 0.455488
C  -1.011022 3.958899 0.298808
C  -1.921737 2.949851 0.084311
C  -1.498474 1.618997 0.030252
C  -2.409952 0.549226 -0.27621
H  -1.343963 -3.425581 0.640236
C  -0.979637 0.118892 -2.563705
C  -0.223113 -0.99467 -1.896578
C  1.297682 -0.783374 -1.94504
C  1.743315 -0.325256 -0.528968
C  2.731749 0.84255 -0.587704
O  3.400237 0.947186 0.558125
C  4.333197 2.021953 0.646019
O  2.931372 1.532959 -1.55061
C  2.481058 -1.480378 0.160734
O  3.598421 -1.779876 -0.499776
C  4.397394 -2.830375 0.049018
O  2.115278 -2.06851 1.143786
C  0.428704 -0.035965 0.247502
C  -0.532726 -1.072518 -0.373955
C  -1.951749 -0.830027 0.031229
C  -2.745306 -1.760946 0.727402
C  -4.041823 -1.41616 1.207093
C  -4.827492 -2.324277 1.882683
C  -4.378778 -3.622288 2.113337
C  -3.114468 -3.99245 1.6541
C  -2.315319 -3.095655 0.982841
C  -0.117576 1.381211 0.195872
N  0.745824 2.365153 0.411293
H  0.943876 5.670334 0.774901
H  2.073826 4.695017 -0.17795
H  1.967338 4.45632 1.564715
H  -1.327768 4.993376 0.346086
H  -2.974761 3.176529 -0.045759
H  -3.464531 0.785507 -0.25426
H  -2.846535 1.084332 -2.861245
H  -2.940441 -0.653089 -2.262715
C  -2.331379 0.227904 -2.441516
H  -0.502884 -1.94592 -2.359299
H  1.571786 -0.020047 -2.67152
H  1.820386 -1.694962 -2.229386
H  4.777996 1.948497 1.634562
H  3.815186 2.973515 0.531421
H  5.097789 1.925759 -0.124567
H  3.843775 -3.768919 0.046042
H  4.692334 -2.585542 1.068895
H  5.270484 -2.901486 -0.593393
H  0.592624 -0.271676 1.300889
H  -0.199192 -2.048727 -0.030087
H  -4.421102 -0.415497 1.051115
H  -5.805691 -2.019674 2.23656
H  -5.000963 -4.333472 2.64222
H  -2.752235 -4.999448 1.826163
H  -0.409504 0.963159 -2.938877
elementType: C H O N
totalener: -1323.45051088660807 hartree
nucrepener: 3049.47644203946311 hartree
electener: -4372.91358448171286 hartree
oneelecener: -7866.23476700986066 hartree
twoeener: 3493.32118252814780 hartree
cpcmener: -0.01337156703938 hartree
kineticenergy: 1317.66151094563475 hartree
xcener: -128.467029751567 hartree
s2: 2.108674
energy: -524.8239 -524.6207 -523.2527 -523.0108 -392.2539 -283.5006 -283.3832 -281.1215 -280.9481 -280.9335 -280.8832 -280.8582 -280.3404 -280.3325 -280.2453 -280.1465 -280.1422 -280.0467 -280.0372 -280.0157 -279.8081 -279.8026 -279.8012 -279.7786 -279.7751 -279.7612 -279.7459 -279.7388 -279.7285 -279.4502 -33.8002 -33.4509 -31.2008 -31.0042 -29.1519 -27.3934 -26.6938 -25.9290 -25.0494 -24.9640 -24.5207 -23.8785 -23.5667 -23.2717 -23.0787 -22.6316 -22.4427 -21.8504 -20.4967 -20.3438 -19.6932 -19.6384 -19.1786 -19.0908 -18.7423 -18.4458 -17.9690 -17.6601 -17.3610 -17.1939 -16.9285 -16.4369 -16.3894 -16.1927 -15.9556 -15.8276 -15.7207 -15.5729 -15.2331 -15.0944 -14.8132 -14.7201 -14.6601 -14.6287 -14.4104 -14.2337 -14.1454 -13.9473 -13.7376 -13.6741 -13.5163 -13.4342 -13.2221 -13.1806 -13.0356 -12.8551 -12.8053 -12.7382 -12.5884 -12.3341 -12.1677 -12.1313 -12.0162 -11.8857 -11.5696 -11.3169 -11.2231 -11.0318 -10.9269 -10.6201 -10.3579 -10.1516 -10.0526 -9.6029 -9.4773 -8.8280 -7.7876 -5.8660 0.9293 1.3865 1.5061 1.5725 1.6314 1.6555 1.8297 1.9044 1.9791 2.0988 2.1149 electronvolt
energy: -524.8238 -524.6204 -523.2523 -523.0108 -392.2778 -283.5007 -283.3824 -281.1215 -280.9481 -280.8958 -280.8816 -280.8222 -280.2341 -280.1899 -280.1725 -280.1570 -280.1178 -280.0619 -280.0486 -280.0138 -279.8589 -279.7932 -279.7848 -279.7737 -279.7452 -279.7314 -279.7269 -279.6772 -279.6459 -279.4525 -33.7996 -33.4502 -31.2000 -31.0037 -29.1173 -27.2206 -26.5825 -25.7224 -24.9439 -24.8501 -24.3006 -23.7754 -23.4742 -23.1571 -23.0441 -22.5130 -22.3610 -21.6710 -20.3997 -20.0749 -19.6390 -19.5933 -19.0906 -18.9845 -18.7023 -18.2319 -17.9515 -17.6161 -17.2781 -17.0810 -16.8422 -16.4017 -16.3120 -16.1617 -15.9018 -15.7926 -15.7082 -15.4657 -15.1934 -15.0157 -14.7533 -14.6501 -14.5531 -14.5091 -14.3790 -14.1933 -14.0636 -13.7217 -13.6993 -13.6227 -13.4090 -13.2262 -13.1271 -12.9976 -12.8851 -12.8266 -12.7575 -12.6091 -12.3212 -12.2640 -12.1006 -12.0670 -11.9762 -11.8150 -11.4589 -11.2105 -10.9836 -10.9574 -10.7388 -10.5939 -10.0683 -9.9649 -9.5288 -9.4550 -9.2691 -8.5065 -1.2307 0.4199 1.0988 1.4027 1.5802 1.5959 1.8103 1.8684 1.9334 1.9686 2.0135 electronvolt
chargesum: -0.0000000
charge: -0.494966 -0.717454 -0.079957 -0.082764 -0.631694 0.084088 0.330064 -0.495715 -0.247814 0.575117 0.513501 0.009626 -0.421456 -0.213421 -0.420409 -0.173198 -0.518880 -0.461486 -0.453611 0.841308 0.720001 -1.023873 -0.394659 -0.434872 -0.125897 -0.688179 -0.210659 -0.504651 0.083115 -0.556840 0.137512 0.229588 0.198545 0.723663 0.467539 0.131680 0.148311 0.147597 0.054192 0.144494 -0.061835 0.028881 0.066253 0.042385 0.431794 0.269301 0.300614 0.155356 -0.007521 0.192168 0.266897 0.667319 0.717052 0.604652 0.139194
charge: 0.351493 -0.308208 0.125062 0.148716 -0.133217 0.099771 -0.062928 0.113562 -0.040175 0.224675 -0.181701 -0.756865 0.268551 0.255034 0.316125 -0.734802 0.269092 0.258958 0.326455 0.028174 -0.033230 -0.063924 -0.137715 0.122152 0.074893 0.076835 0.076921 0.129476 -0.191294 0.334445 -0.073310 -0.066360 -0.067032 -0.055321 -0.040772 -0.061731 -0.068333 -0.063929 0.291870 -0.011188 -0.042774 -0.027281 -0.049193 -0.068506 -0.047488 -0.048162 -0.047855 -0.051348 -0.005419 -0.040093 -0.068577 -0.061932 -0.069302 -0.061428 -0.050872
qa: -0.4950 -0.7175 -0.0800 -0.0828 -0.6317 0.0841 0.3301 -0.4957 -0.2478 0.5751 0.5135 0.0096 -0.4215 -0.2134 -0.4204 -0.1732 -0.5189 -0.4615 -0.4536 0.8413 0.7200 -1.0239 -0.3947 -0.4349 -0.1259 -0.6882 -0.2107 -0.5047 0.0831 -0.5568 0.1375 0.2296 0.1985 0.7237 0.4675 0.1317 0.1483 0.1476 0.0542 0.1445 -0.0618 0.0289 0.0663 0.0424 0.4318 0.2693 0.3006 0.1554 -0.0075 0.1922 0.2669 0.6673 0.7171 0.6047 0.1392
va: 4.0844 5.3002 3.6363 3.4995 3.3443 1.9561 0.8617 3.5610 3.3101 2.4810 1.7540 3.5854 1.9349 3.7429 2.1125 3.3495 1.9161 3.7343 2.1231 1.2046 0.4741 2.2971 3.0107 3.4694 3.8051 4.4725 4.0422 3.5649 1.4753 2.2540 1.0051 1.0836 1.0907 0.1418 0.6212 0.8246 0.9789 0.9953 3.6548 0.7821 1.1044 0.9453 1.2527 1.4087 1.1216 1.1801 1.0805 1.5044 0.9564 0.6186 0.9631 0.2825 0.1783 0.4384 0.7983
dispersion: -0.033737158 hartree
energy: -1323.484248044758 hartree
dipole: 1.209237111 -1.345147549 -0.135910437 2.544480947 -2.352262686 0.192218260 -1.368037256 1.326630813 -0.041406442
dipolemethod: SCF
magnitude: 0.239027195 au
magnitude: 0.607558847 debye
