program: Orca
programVersion: 6.0.1
elementType: C C C C C C H C C C C C O C O C O C O C C C C C C C C C C N H H H H H H H H C H H H H H H H H H H H H H H H H
charge: 0
multiplicity: 3
keywords: UKS wB97X-D3 def2-QZVPPD DEF2/J RIJCOSX DEFGRID3 CPCM(Toluene) TightSCF
formula: C25H25NO4
InChI: InChI=1/C25H25NO4/c1-5-16-14-25(23(27)29-3,24(28)30-4)21-20(16)19(17-9-7-6-8-10-17)13-18-12-11-15(2)26-22(18)21/h5-13,16,20-21H,1,14H2,2-4H3
55 atoms
C  1.315825 4.639843 1.252177
C  0.330493 3.633427 0.742162
C  -0.919304 4.008701 0.239432
C  -1.782568 3.039863 -0.202693
C  -1.405483 1.677462 -0.150243
C  -2.280934 0.647824 -0.504053
H  -1.658324 -3.388453 0.433913
C  -1.151671 -0.898689 -2.709653
C  0.04046 -1.163664 -1.854189
C  1.215157 -0.196551 -1.9728
C  1.764187 -0.113152 -0.544299
C  2.769543 1.023029 -0.370912
O  3.426466 0.898255 0.779878
C  4.362337 1.930304 1.087272
O  2.98803 1.878548 -1.185953
C  2.510927 -1.401745 -0.178259
O  3.535553 -1.599364 -1.005816
C  4.349601 -2.744645 -0.740648
O  2.233471 -2.146055 0.724244
C  0.468421 -0.002928 0.310673
C  -0.451213 -1.059729 -0.353658
C  -1.93563 -0.769833 -0.29025
C  -2.792907 -1.556579 0.600983
C  -3.942351 -0.99969 1.182061
C  -4.77371 -1.750898 1.99571
C  -4.491757 -3.085772 2.24912
C  -3.362261 -3.659083 1.67722
C  -2.527227 -2.909864 0.86942
C  -0.089968 1.404783 0.312751
N  0.712322 2.353389 0.760266
H  0.860928 5.62306 1.369054
H  2.152853 4.729774 0.554522
H  1.720891 4.317871 2.212672
H  -1.199217 5.054707 0.214678
H  -2.766874 3.301359 -0.575279
H  -3.255741 0.906159 -0.901041
H  -3.267567 -1.234305 -2.692348
H  -2.25506 -2.514355 -1.863967
C  -2.299289 -1.518961 -2.293992
H  0.392926 -2.188108 -2.013568
H  0.873077 0.800306 -2.259419
H  1.969298 -0.506744 -2.693515
H  4.801667 1.655603 2.042129
H  3.845054 2.886202 1.167041
H  5.129859 1.993934 0.316455
H  3.753148 -3.654798 -0.792105
H  4.803017 -2.662936 0.246853
H  5.114656 -2.746259 -1.511664
H  0.687959 -0.277233 1.343413
H  -0.245037 -2.002949 0.142785
H  -4.176981 0.042831 1.006127
H  -5.648185 -1.287782 2.437999
H  -5.142028 -3.674615 2.884552
H  -3.13009 -4.701095 1.864125
H  -1.176752 -0.030404 -3.359363
elementType: C H O N
totalener: -1323.44934794223855 hartree
nucrepener: 3052.38191402941720 hartree
electener: -4375.81784650519967 hartree
oneelecener: -7871.95767522908409 hartree
twoeener: 3496.13982872388442 hartree
cpcmener: -0.01341991575655 hartree
kineticenergy: 1317.65947462464783 hartree
xcener: -128.460687682597 hartree
s2: 2.103068
energy: -524.8728 -524.6653 -523.2692 -523.0432 -392.3252 -283.5239 -283.4005 -281.1348 -281.0214 -280.9764 -280.9208 -280.8633 -280.6129 -280.2637 -280.1972 -280.1601 -280.1134 -280.0873 -279.9716 -279.9375 -279.8294 -279.8142 -279.7794 -279.7634 -279.7524 -279.7511 -279.7446 -279.7318 -279.7125 -279.4655 -33.8209 -33.4859 -31.2237 -31.0318 -29.2290 -27.3966 -26.7194 -25.9564 -25.3197 -25.0174 -24.3706 -23.7347 -23.5429 -23.2488 -23.1477 -22.7780 -22.2793 -21.8216 -20.5600 -20.3276 -19.7269 -19.6077 -19.2321 -19.0576 -18.8232 -18.3308 -18.0057 -17.6029 -17.3633 -17.1238 -16.9522 -16.5083 -16.3700 -16.2254 -16.0460 -15.8816 -15.7597 -15.5441 -15.2760 -15.0870 -14.8868 -14.8251 -14.6747 -14.5845 -14.3788 -14.2592 -14.1222 -13.9586 -13.7778 -13.6871 -13.5826 -13.4417 -13.2546 -13.1894 -13.1603 -12.9140 -12.8253 -12.6475 -12.4875 -12.3932 -12.1594 -12.1190 -11.9217 -11.8077 -11.5902 -11.3068 -11.2109 -11.0442 -10.9710 -10.6936 -10.3481 -10.0724 -9.7780 -9.5246 -9.4303 -9.2108 -7.4713 -6.3098 0.9486 1.3757 1.4793 1.5804 1.6056 1.6383 1.7935 1.8783 1.9666 2.0159 2.0878 electronvolt
energy: -524.8724 -524.6650 -523.2690 -523.0438 -392.3771 -283.5240 -283.4003 -281.1347 -280.9764 -280.9487 -280.8581 -280.8435 -280.4533 -280.2634 -280.2115 -280.1372 -280.1308 -279.9710 -279.9424 -279.9077 -279.8676 -279.8285 -279.7776 -279.7680 -279.7499 -279.7152 -279.6963 -279.6793 -279.6661 -279.4703 -33.8201 -33.4855 -31.2230 -31.0324 -29.1740 -27.2461 -26.6552 -25.7364 -25.1357 -24.9057 -24.1723 -23.6488 -23.4875 -23.1560 -23.0670 -22.6679 -22.2129 -21.6465 -20.4911 -20.0462 -19.6406 -19.5480 -19.1463 -18.9527 -18.7831 -18.1295 -17.9864 -17.5412 -17.2701 -16.9949 -16.8742 -16.4668 -16.3033 -16.1891 -15.9563 -15.8652 -15.7469 -15.4305 -15.2221 -15.0156 -14.8113 -14.6887 -14.5772 -14.4398 -14.2848 -14.1727 -14.0578 -13.8043 -13.7051 -13.6430 -13.5059 -13.2981 -13.0900 -13.0469 -13.0378 -12.8816 -12.7701 -12.5866 -12.3605 -12.2601 -12.0993 -12.0334 -11.8363 -11.7158 -11.4965 -11.2671 -11.0415 -11.0121 -10.6611 -10.5258 -10.0919 -10.0351 -9.5590 -9.3588 -9.2675 -8.6626 -0.8652 0.0629 1.2621 1.4051 1.5707 1.6003 1.7313 1.8392 1.9233 1.9581 1.9990 electronvolt
chargesum: -0.0000000
charge: -0.461992 -0.659751 0.060594 -0.194752 -0.624548 -0.638715 0.273971 -0.317281 -0.477795 0.166190 0.641590 0.215262 -0.398613 -0.224731 -0.400582 -0.119387 -0.535153 -0.461795 -0.482637 1.235835 0.491900 -0.080682 -0.356207 -0.593000 -0.190956 -0.818002 -0.258772 -0.238274 -0.008569 -0.556128 0.087167 0.255249 0.216813 0.765016 0.515317 0.138653 0.128328 0.014066 -0.123800 0.157560 0.008289 0.086196 0.075135 0.049000 0.420589 0.314422 0.289798 0.099900 0.044127 0.130380 0.341041 0.568268 0.732372 0.519059 0.180033
charge: 0.350902 -0.304098 0.122295 0.152227 -0.124758 0.157111 -0.054909 0.111049 -0.050723 0.199691 -0.210610 -0.758103 0.273494 0.256756 0.324290 -0.733885 0.277316 0.260883 0.331060 0.031659 -0.012862 -0.144463 -0.147813 0.119264 0.081836 0.072630 0.085067 0.109045 -0.198186 0.331132 -0.073078 -0.067227 -0.065744 -0.053764 -0.045278 -0.046560 -0.064644 -0.071925 0.295856 -0.010371 -0.019556 -0.019920 -0.049950 -0.064589 -0.048197 -0.049099 -0.046924 -0.051468 -0.002248 -0.046445 -0.060575 -0.062179 -0.066925 -0.061128 -0.055352
qa: -0.4620 -0.6598 0.0606 -0.1948 -0.6245 -0.6387 0.2740 -0.3173 -0.4778 0.1662 0.6416 0.2153 -0.3986 -0.2247 -0.4006 -0.1194 -0.5352 -0.4618 -0.4826 1.2358 0.4919 -0.0807 -0.3562 -0.5930 -0.1910 -0.8180 -0.2588 -0.2383 -0.0086 -0.5561 0.0872 0.2552 0.2168 0.7650 0.5153 0.1387 0.1283 0.0141 -0.1238 0.1576 0.0083 0.0862 0.0751 0.0490 0.4206 0.3144 0.2898 0.0999 0.0441 0.1304 0.3410 0.5683 0.7324 0.5191 0.1800
va: 4.0219 5.0825 3.4015 3.6613 3.5575 3.1647 0.8042 3.8303 3.4865 3.2764 1.5211 3.0340 1.8414 3.6394 2.1416 3.4033 1.9626 3.6982 2.0701 0.9522 0.0292 2.1291 2.9308 4.1063 3.8330 4.5134 3.9363 3.2945 1.7405 2.2877 1.2014 0.9574 0.9850 0.0431 0.4925 0.8731 0.9913 1.1150 3.7798 0.8789 0.9806 0.9931 1.4018 1.5457 1.1079 1.0886 1.1201 1.6174 0.7848 0.6343 0.8501 0.5345 0.1302 0.6226 0.8561
dispersion: -0.034338079 hartree
energy: -1323.483686021083 hartree
dipole: 0.717915913 -0.831167754 -0.113251841 0.647786814 -0.482662653 0.165124161 -0.607396062 0.485413148 -0.121982913
dipolemethod: SCF
magnitude: 0.234460656 au
magnitude: 0.595951627 debye
