program: Orca
programVersion: 6.0.1
elementType: C C C C C C C C C C C C O C O C O C O C C C C C C C C C C N H H H H H H H H H H H H H H H H H H H H H H H H H
charge: 0
multiplicity: 3
keywords: UKS wB97X-D3 def2-QZVPPD DEF2/J RIJCOSX DEFGRID3 CPCM(Toluene) TightSCF
formula: C25H25NO4
InChI: InChI=1/C25H25NO4/c1-5-16-14-25(23(27)29-3,24(28)30-4)21-20(16)19(17-9-7-6-8-10-17)13-18-12-11-15(2)26-22(18)21/h5-13,16,20-21H,1,14H2,2-4H3
55 atoms
C  1.361368 4.603509 1.699307
C  0.416539 3.601124 1.109221
C  -0.787911 3.99253 0.510717
C  -1.61741 3.038066 -0.013306
C  -1.255773 1.670568 0.052915
C  -2.112505 0.657868 -0.383526
C  -1.71282 -0.677599 -2.994043
C  -1.345197 -1.503859 -1.95423
C  0.030637 -1.521146 -1.298958
C  1.056546 -0.470461 -1.710553
C  1.771687 -0.170019 -0.386998
C  2.682154 1.048284 -0.475675
O  3.580989 1.047566 0.503862
C  4.452507 2.176978 0.561913
O  2.61169 1.892537 -1.328593
C  2.626871 -1.37219 0.023845
O  3.572811 -1.607018 -0.883397
C  4.453814 -2.699602 -0.610141
O  2.471124 -2.040166 1.011421
C  0.582307 -0.017089 0.614309
C  -0.380553 -1.131692 0.136862
C  -1.835452 -0.767981 -0.145566
C  -2.910533 -1.582539 0.441678
C  -4.184077 -1.050186 0.683225
C  -5.205755 -1.832389 1.197393
C  -4.991145 -3.172943 1.479843
C  -3.736656 -3.721574 1.243894
C  -2.714781 -2.941626 0.734087
C  0.015375 1.383703 0.614592
N  0.78977 2.32073 1.139134
H  0.839318 5.504965 2.020715
H  2.108725 4.897611 0.956544
H  1.888098 4.169819 2.54891
H  -1.058525 5.040928 0.479305
H  -2.565697 3.312032 -0.462449
H  -3.031394 0.934374 -0.885392
H  -1.106077 0.163353 -3.305281
H  -2.674291 -0.798293 -3.477368
H  -1.896153 -2.434667 -1.85572
H  0.473875 -2.518371 -1.361217
H  0.583838 0.454982 -2.042799
H  1.736046 -0.796834 -2.495822
H  5.102734 2.004215 1.414693
H  3.871262 3.087443 0.703737
H  5.036131 2.25357 -0.355043
H  3.893237 -3.632277 -0.55502
H  4.979785 -2.535171 0.329718
H  5.154357 -2.726282 -1.439844
H  0.940332 -0.223074 1.622129
H  -0.3133 -1.964235 0.831553
H  -4.376745 -0.004157 0.483682
H  -6.176897 -1.387183 1.38002
H  -5.790417 -3.784872 1.880014
H  -3.552383 -4.767839 1.45819
H  -1.751483 -3.403421 0.553513
elementType: C O N H
totalener: -1323.44782532470276 hartree
nucrepener: 3047.65468880402113 hartree
electener: -4371.08897252724637 hartree
oneelecener: -7862.36712421981611 hartree
twoeener: 3491.27815169257019 hartree
cpcmener: -0.01354739716884 hartree
kineticenergy: 1317.65426743774333 hartree
xcener: -128.462215245817 hartree
s2: 2.089280
energy: -524.8714 -524.7392 -523.2747 -523.1170 -392.3250 -283.5183 -283.4373 -281.1401 -281.0152 -280.9982 -280.9192 -280.8981 -280.6555 -280.2603 -280.1919 -280.1600 -280.1444 -280.1406 -280.0891 -279.9720 -279.9615 -279.8185 -279.8109 -279.8030 -279.7877 -279.7849 -279.7691 -279.7515 -279.5824 -279.4677 -33.8351 -33.5430 -31.2265 -31.0966 -29.2080 -27.5471 -26.7468 -25.9429 -25.3533 -24.9983 -24.2628 -23.7600 -23.5741 -23.2453 -23.1607 -22.7429 -22.5665 -21.7540 -20.5787 -20.3800 -19.8457 -19.7237 -19.2601 -19.0167 -18.8692 -18.3049 -17.9603 -17.6274 -17.2983 -17.1521 -16.9057 -16.5490 -16.3262 -16.3031 -16.0699 -15.9412 -15.8091 -15.7567 -15.2101 -15.1621 -14.8910 -14.8407 -14.6555 -14.5877 -14.3801 -14.3362 -14.1415 -13.8921 -13.8363 -13.7928 -13.6519 -13.4093 -13.2601 -13.1588 -13.1032 -12.9182 -12.8438 -12.6110 -12.5754 -12.3555 -12.1877 -12.1063 -11.8697 -11.8518 -11.4441 -11.3121 -11.2409 -11.0761 -11.0243 -10.7091 -10.4249 -10.1220 -9.7464 -9.5445 -9.4717 -9.4195 -7.5798 -6.2318 0.9796 1.3568 1.4836 1.5650 1.5856 1.6198 1.8065 1.8806 1.9610 1.9970 2.0816 electronvolt
energy: -524.8711 -524.7391 -523.2745 -523.1173 -392.3768 -283.5182 -283.4372 -281.1400 -281.0152 -280.9229 -280.8930 -280.8426 -280.5036 -280.2614 -280.2133 -280.1807 -280.1638 -280.1283 -279.9751 -279.9526 -279.9109 -279.8560 -279.8131 -279.8113 -279.7985 -279.7630 -279.7412 -279.7249 -279.4725 -279.4309 -33.8343 -33.5427 -31.2258 -31.0970 -29.1507 -27.4174 -26.6945 -25.7367 -25.2283 -24.8938 -24.1173 -23.6323 -23.5248 -23.1522 -23.0567 -22.6578 -22.3588 -21.5745 -20.5248 -20.1182 -19.6813 -19.6388 -19.1603 -18.9301 -18.8261 -18.2070 -17.9035 -17.5607 -17.2044 -17.0900 -16.8452 -16.4886 -16.2751 -16.2545 -15.9848 -15.9234 -15.7884 -15.7022 -15.1305 -15.0871 -14.8310 -14.7439 -14.5031 -14.4537 -14.3055 -14.1882 -14.0601 -13.8242 -13.7667 -13.7187 -13.5558 -13.2933 -13.1433 -13.0513 -12.9910 -12.8851 -12.7772 -12.5716 -12.4579 -12.3045 -12.1038 -12.0405 -11.8097 -11.7349 -11.3376 -11.2813 -11.0654 -11.0301 -10.7179 -10.5429 -10.1173 -10.0583 -9.5803 -9.3206 -9.3108 -8.6960 -0.9929 0.0960 1.2850 1.3867 1.5734 1.6042 1.6706 1.8285 1.8853 1.9722 2.0190 electronvolt
chargesum: -0.0000000
charge: -0.343296 -0.603705 0.018994 -0.142662 -0.210254 -0.868979 0.079326 -0.924114 -0.057374 0.170269 0.247209 0.286856 -0.437336 -0.351829 -0.425315 0.028393 -0.501225 -0.432993 -0.460525 1.054460 0.619752 0.022021 -0.668321 -0.379630 -0.315925 -0.716999 -0.191889 -0.263477 -0.062407 -0.563396 0.128372 0.180273 0.134755 0.566744 0.554043 0.138022 0.099843 0.208243 0.176745 0.277690 0.022827 0.168851 0.044730 0.208307 0.393730 0.241865 0.255723 0.162462 0.011507 0.027646 0.215848 0.630267 0.782732 0.504898 0.258248
charge: 0.349142 -0.310095 0.122880 0.153730 -0.123545 0.162027 0.372923 0.017409 -0.035640 0.201301 -0.205222 -0.749666 0.276571 0.259658 0.329514 -0.736997 0.277212 0.260417 0.334037 0.037280 -0.002763 -0.130933 -0.137545 0.119890 0.083708 0.073687 0.086986 0.109762 -0.206882 0.327291 -0.072205 -0.067999 -0.066975 -0.052456 -0.044250 -0.053363 -0.102688 -0.101343 -0.046367 -0.008792 -0.031918 -0.014516 -0.049369 -0.064279 -0.047415 -0.048650 -0.047553 -0.051557 -0.009586 -0.029935 -0.063507 -0.061691 -0.066046 -0.060830 -0.052843
qa: -0.3433 -0.6037 0.0190 -0.1427 -0.2103 -0.8690 0.0793 -0.9241 -0.0574 0.1703 0.2472 0.2869 -0.4373 -0.3518 -0.4253 0.0284 -0.5012 -0.4330 -0.4605 1.0545 0.6198 0.0220 -0.6683 -0.3796 -0.3159 -0.7170 -0.1919 -0.2635 -0.0624 -0.5634 0.1284 0.1803 0.1348 0.5667 0.5540 0.1380 0.0998 0.2082 0.1767 0.2777 0.0228 0.1689 0.0447 0.2083 0.3937 0.2419 0.2557 0.1625 0.0115 0.0276 0.2158 0.6303 0.7827 0.5049 0.2582
va: 3.9300 4.8408 3.7235 3.5901 2.9312 3.2596 3.6582 4.2335 2.1350 2.7431 2.0886 3.1993 1.8778 3.6211 2.1506 3.5108 1.8854 3.7600 2.0905 0.2586 0.5865 1.1789 3.0062 3.7474 3.9841 4.3911 3.9221 3.3947 1.5361 1.9513 1.1076 1.0266 1.0015 0.4199 0.4855 0.8089 1.1502 1.1335 0.7838 0.5690 0.8569 0.9046 1.5680 1.4326 1.1582 1.1554 1.1434 1.5284 0.7957 0.8211 1.0651 0.4183 0.0759 0.5831 0.8319
dispersion: -0.033899430 hartree
energy: -1323.481724754327 hartree
dipole: 0.904537862 -0.834579621 0.069958241 1.233953386 -1.164000066 0.069953320 -2.459608013 2.250413650 -0.209194363
dipolemethod: SCF
magnitude: 0.231408522 au
magnitude: 0.588193717 debye
