program: Gaussian 16
title: ppr_mech_cycloaddition_product
version: ES64L-G16RevC.01
frameworkgroup: C1[X(C25H25NO4)]
method: RM062X
basis: 6-31G(d)
operation: Freq
keyword: #P
keyword: Geom=AllCheck
keyword: Guess=TCheck
keyword: SCRF=Check
keyword: Test
keyword: GenChk
keyword: RM062X/6-31G(d)Freq
converged: YES YES YES YES
title: Mulliken charges:
elementType: C C C C C C C C C C C C O C O C O C O C C C C C C C C C C N H H H H H H H H H H H H H H H H H H H H H H H H H
charge: -0.531250 0.271201 -0.195209 -0.174859 0.096732 -0.252133 -0.337504 -0.145250 -0.120978 -0.346797 -0.147312 0.710378 -0.490998 -0.242378 -0.492462 0.675340 -0.493817 -0.244418 -0.482496 -0.221899 -0.194656 0.098223 0.054197 -0.200202 -0.167247 -0.160690 -0.169597 -0.175941 0.218129 -0.532330 0.164365 0.195384 0.184257 0.165636 0.165899 0.163939 0.178398 0.168450 0.160456 0.151186 0.179594 0.200445 0.180539 0.185251 0.181889 0.182220 0.187801 0.185676 0.209004 0.189512 0.161700 0.162322 0.162372 0.163643 0.166287
chargesum: -0.00000
title: Mulliken charges with hydrogens summed into heavy atoms:
elementType: C C C C C C C C C C C C O C O C O C O C C C C C C C C C C N
charge: 0.012756 0.271201 -0.029573 -0.008960 0.096732 -0.088194 0.009343 0.015206 0.030208 0.033242 -0.147312 0.710378 -0.490998 0.305302 -0.492462 0.675340 -0.493817 0.311278 -0.482496 -0.012895 -0.005144 0.098223 0.054197 -0.038501 -0.004925 0.001682 -0.005954 -0.009653 0.218129 -0.532330
chargesum: 0.00000
polarizability: 3.42987097e+02 -7.64516707e+00 2.75577845e+02 -1.04085442e+01 -1.09390202e+01 1.68935643e+02
1716.lowfreq: -5.8914 -3.8738 0.0004 0.0007 0.0007 5.9297 32.6542 43.6507 45.4983
frequency: 32.6337 43.6468 45.4967 49.7335 59.4892 70.4254 76.1256 83.1284 103.6108 110.9760 123.2747 136.8487 153.4517 162.0479 175.7458 180.9078 187.8830 198.9233 213.6699 223.1122 236.9782 246.3249 265.4215 284.3192 307.3863 318.1486 337.8094 342.5398 362.2111 391.0676 405.8078 420.2549 434.7056 443.7351 462.1989 491.7255 503.4080 537.5899 550.8287 560.5964 595.4079 611.9077 621.8697 633.4587 662.3674 686.4085 703.9993 707.1272 721.2180 755.0263 760.6415 774.3249 788.6183 806.2465 817.2782 842.2614 855.3694 858.2110 868.6503 877.9217 906.1515 924.6083 932.8302 954.2851 963.7754 982.5256 990.8051 996.9432 999.1611 1014.5257 1016.6017 1021.3045 1023.2152 1033.5697 1035.4563 1049.9225 1073.8857 1074.2724 1090.3103 1101.5416 1122.1597 1129.3996 1143.4653 1156.8162 1169.3304 1186.1249 1194.2355 1195.9000 1206.6298 1214.2691 1229.6790 1233.1829 1240.6746 1250.3464 1256.8818 1276.3123 1286.9420 1294.8695 1298.0468 1309.5933 1311.0632 1323.3287 1325.8772 1346.6985 1357.5167 1362.4002 1365.4437 1369.1100 1378.9532 1417.8228 1433.3720 1442.8536 1479.4699 1493.2904 1497.1297 1500.7695 1505.5303 1506.4356 1514.2524 1518.0428 1518.7469 1524.5182 1528.7830 1529.6610 1539.7490 1555.0746 1666.2202 1669.1789 1692.6198 1695.7474 1769.6270 1775.3966 1879.5842 1892.8995 3081.9703 3086.7099 3088.9127 3105.1766 3108.2129 3114.6806 3126.0387 3140.8943 3157.0503 3157.3285 3176.6474 3180.1816 3187.1893 3187.8071 3202.9257 3204.9192 3215.4122 3219.8048 3219.8213 3222.5924 3228.4951 3235.1867 3239.7872 3245.7901 3249.2197
redmass: 4.9152 4.5756 5.1961 3.8808 3.9056 4.4371 4.2493 4.5106 3.8889 1.2925 2.4362 3.5863 4.1312 1.2042 3.6342 1.2315 3.9584 2.9291 4.2978 4.4472 4.1527 5.5139 5.0150 4.7993 3.7174 3.7197 3.7523 3.6563 3.4746 3.2347 3.6757 3.0183 5.1235 6.4539 4.0881 4.1297 4.5976 3.4123 4.6400 3.5601 3.2021 4.5229 4.8620 5.9437 4.6939 3.6202 5.0027 4.7337 1.8842 2.8825 3.9511 2.3149 3.8562 2.8163 4.8146 4.0645 1.9417 2.1402 3.1728 1.2812 2.7202 2.1167 2.6168 1.5347 2.9713 3.9590 2.0839 1.3613 1.6043 1.6005 3.2887 1.4535 2.5435 3.1656 1.8748 2.3884 1.9689 1.5941 2.8331 3.5158 1.6516 2.7026 2.9290 1.5323 3.1738 1.1121 1.2947 1.2841 1.8219 1.1394 1.5722 1.5406 1.4436 1.4861 1.6074 1.3813 2.4284 1.7411 1.9710 2.6900 2.0502 2.4327 2.3878 1.7583 2.0751 1.8832 1.8467 1.4888 1.6418 2.1398 1.3911 1.5372 2.9393 1.2369 1.1733 2.3459 1.1707 1.0470 1.1127 1.0576 1.0448 1.1785 1.0498 1.0470 3.7840 2.4531 6.2191 6.3243 7.5743 6.0967 8.2969 6.9166 12.1444 12.1690 1.0762 1.0367 1.0714 1.0301 1.0304 1.0606 1.0841 1.1005 1.1008 1.1014 1.0872 1.1035 1.1073 1.1072 1.0901 1.0949 1.0854 1.0891 1.1060 1.1072 1.0912 1.0951 1.0943 1.0987 1.0906
irintensity: 0.2404 0.9671 0.3929 0.1564 1.2576 1.7192 0.2600 0.5116 1.0060 0.8210 0.0207 0.3936 0.5028 0.3854 1.3051 0.4609 1.7022 0.5240 2.5005 3.9361 1.0482 0.5376 0.0899 2.8854 9.1065 7.8866 8.3154 2.8732 16.1918 0.1246 2.6078 0.0327 4.9808 5.1490 3.6572 1.8813 3.9265 0.2749 3.0618 4.8477 1.1035 10.7313 6.3846 1.8042 4.0328 11.0884 2.3654 9.8467 28.6501 2.5388 10.0409 9.8854 17.0953 33.9202 2.2725 12.5640 11.0176 0.9239 2.8237 0.5344 6.3383 9.7253 8.4831 0.2745 9.1417 4.8671 9.2719 0.6179 1.3603 1.4155 4.4240 0.2856 2.6352 1.9999 1.4876 3.2288 5.1150 4.5906 2.8228 15.4445 7.0435 26.1371 21.0945 4.7961 6.7216 0.0135 0.5494 1.5100 21.1552 2.3303 12.7086 11.7725 10.6159 17.5642 105.7475 39.0554 65.3690 71.5956 27.5094 36.4074 129.7739 176.8931 87.9841 11.9181 33.3143 29.8392 96.0904 47.5311 17.1474 6.0395 0.8539 0.9012 11.7539 17.1956 6.0315 4.3561 16.3368 9.8023 16.0488 1.9719 5.9329 25.4980 6.4846 9.2210 71.2939 17.7236 16.5107 8.6023 44.6948 2.2473 0.1456 2.1489 378.8276 23.2856 8.6839 15.5961 19.8848 31.3701 29.5402 5.6825 1.0343 20.7097 9.1387 1.0885 9.3921 15.2126 13.1627 16.6068 9.0766 26.1062 7.0311 0.7860 12.3866 12.9965 7.1777 23.7155 12.6640 19.0018 7.6380
temp: 298.150 k
press: 1.00000 atm
elementType: 6 6 6 6 6 6 6 6 6 6 6 6 8 6 8 6 8 6 8 6 6 6 6 6 6 6 6 6 6 7 1 1 1 1 1 1 1 1 1 1 1 1 1 1 1 1 1 1 1 1 1 1 1 1 1
symmnumber: 1
zpe: 1201846.1 jmol-1
zpe.correction: 0.457759 hartree
zpe.thermalcorrener: 0.484361 hartree
zpe.thermalcorrenthalpy: 0.485305 hartree
zpe.thermalcorrgfe: 0.401187 hartree
zpe.sumelectzpe: -1322.365735 hartree
zpe.sumelectthermal: -1322.339133 hartree
zpe.sumelectthermalent: -1322.338189 hartree
zpe.sumelectthermalfe: -1322.422306 hartree
dipole: -0.2953 -0.5322 0.7269
dipole: 0.9480
quadrupole: -159.4560 -148.4459 -180.6087
quadrupole: 1.4369 -8.5507 0.4335
quadrupole: 3.3809 14.3910 -17.7719 1.4369 -8.5507 0.4335
hfenergy: -1322.8234936 hartree
pointgroup: C01 [X(C25H25N1O4)]
dipole: -0.2384601 0.0975335 -0.2697059 debye
polarizability: 313.4186802|34.1915709|306.4686689|3.7431096|-6.3555556|167.6132363 unknown
InChI: InChI=1/C25H25NO4/c1-16-12-13-19-18-11-7-8-14-25(23(27)29-2,24(28)30-3)21(22(19)26-16)15-20(18)17-9-5-4-6-10-17/h4-10,12-13,15,18,21H,11,14H2,1-3H3
charge 0 multiplicity 1
55 atoms
C  1.48232445 5.00121653 0.5135373
C  0.49735309 3.88324251 0.30712113
C  -0.75206658 4.09333548 -0.28043116
C  -1.59298782 3.00628459 -0.47560174
C  -1.17978925 1.7320593 -0.09255084
C  -2.05630996 0.51952403 -0.30730408
C  -2.03938485 0.00242947 -1.80536025
C  -1.21171205 -1.23479384 -2.05748672
C  0.11530216 -1.32864596 -1.96428302
C  1.05982914 -0.19665938 -1.67852031
C  1.64935919 -0.16658938 -0.24866961
C  2.7960405 0.86004997 -0.24953194
O  3.45241658 0.83770318 0.91774244
C  4.38103628 1.90530254 1.0974765
O  3.06812581 1.59475517 -1.16243638
C  2.26599429 -1.51435209 0.11824896
O  3.10425153 -1.92726836 -0.84763935
C  3.76239348 -3.16608749 -0.58218145
O  2.06365747 -2.14059993 1.12703867
C  0.6338759 0.27182229 0.86837462
C  -0.46790143 -0.72050073 1.13047122
C  -1.70415885 -0.6023917 0.63730592
C  -2.71611962 -1.66948883 0.83869442
C  -4.06446608 -1.37168347 1.07027379
C  -4.99664241 -2.38712527 1.25856288
C  -4.59976577 -3.72101927 1.20725394
C  -3.26382156 -4.03181196 0.9653735
C  -2.33259412 -3.01597579 0.77769188
C  0.08303285 1.6268869 0.49524307
N  0.89471695 2.66814376 0.69502179
H  1.05245485 5.97286877 0.25965455
H  2.36208713 4.83246492 -0.11656816
H  1.8187919 5.02231544 1.55393732
H  -1.05282764 5.09267372 -0.57810823
H  -2.57252962 3.14328569 -0.9298665
H  -3.08747383 0.84156869 -0.12041665
H  -1.70181953 0.83085459 -2.4393868
H  -3.07132348 -0.21392433 -2.09420949
H  -1.77105118 -2.14265379 -2.27447816
H  0.57896457 -2.30081142 -2.13232246
H  0.58285263 0.77138849 -1.86107412
H  1.90732558 -0.25431209 -2.36724383
H  4.84319506 1.7368243 2.06877774
H  3.8379846 2.85376087 1.08535668
H  5.13025526 1.90003891 0.30356502
H  3.02878866 -3.96676872 -0.46554901
H  4.35416687 -3.09083774 0.33235081
H  4.40235066 -3.3515295 -1.44297746
H  1.23216959 0.38524479 1.777502
H  -0.21446134 -1.56313826 1.76505492
H  -4.38576658 -0.33552062 1.13202133
H  -6.03549001 -2.13562451 1.44981886
H  -5.32831824 -4.51317502 1.34947493
H  -2.94731413 -5.06914021 0.91208236
H  -1.29494109 -3.25358524 0.55915916
