program: Orca
programVersion: 6.0.1
elementType: C C C C C C C C C C C C O C O C O C O C C C C C C C C C C N H H H H H H H H H H H H H H H H H H H H H H H H H
charge: 0
multiplicity: 3
keywords: wB97X-D3 def2-QZVPPD DEF2/J RIJCOSX DEFGRID3 CPCM(Toluene) SlowConv Opt SurfCrossOpt
formula: C25H25NO4
InChI: InChI=1/C25H25NO4/c1-5-16-14-25(23(27)29-3,24(28)30-4)21-20(16)19(17-9-7-6-8-10-17)13-18-12-11-15(2)26-22(18)21/h5-13,16,20-21H,1,14H2,2-4H3
55 atoms
C  1.054979 4.126378 2.338569
C  0.225202 3.269335 1.432718
C  -0.867754 3.797602 0.723051
C  -1.653531 2.963631 -0.018564
C  -1.357635 1.573761 -0.05748
C  -2.141358 0.609246 -0.648873
C  -1.169958 -0.625249 -3.908077
C  -1.072401 -1.400294 -2.83866
C  0.017807 -1.358546 -1.811189
C  1.05754 -0.250558 -1.949485
C  1.693326 -0.194875 -0.555728
C  2.59324 1.021495 -0.378507
O  3.44971 0.84524 0.622824
C  4.336411 1.929505 0.895826
O  2.556651 2.003688 -1.069206
C  2.5431 -1.446396 -0.315124
O  3.528526 -1.525124 -1.206199
C  4.411217 -2.641846 -1.076523
O  2.348209 -2.272226 0.535818
C  0.446242 -0.230091 0.378503
C  -0.491437 -1.2537 -0.332043
C  -1.901825 -0.812151 -0.165408
C  -2.838534 -1.428067 0.664507
C  -4.105881 -0.812508 0.895561
C  -5.058162 -1.402026 1.696737
C  -4.816056 -2.635162 2.298206
C  -3.589681 -3.269464 2.083376
C  -2.623382 -2.692271 1.295771
C  -0.147235 1.157887 0.589356
N  0.575947 1.986988 1.325273
H  0.728979 5.163917 2.316257
H  2.104358 4.083812 2.048105
H  0.987132 3.762038 3.364416
H  -1.091233 4.85358 0.790403
H  -2.523114 3.337265 -0.544243
H  -2.857952 0.851267 -1.422217
H  -0.4472 0.151486 -4.125898
H  -1.986446 -0.743372 -4.60811
H  -1.826814 -2.164591 -2.674053
H  0.539259 -2.318457 -1.884003
H  0.587105 0.715106 -2.136736
H  1.785055 -0.430781 -2.737491
H  4.919454 1.624839 1.758061
H  3.770009 2.830839 1.118837
H  4.984767 2.111231 0.040813
H  3.861549 -3.573836 -1.191363
H  4.898202 -2.625122 -0.103628
H  5.142757 -2.532171 -1.86976
H  0.733968 -0.617344 1.352949
H  -0.33868 -2.212779 0.148976
H  -4.320724 0.140195 0.430247
H  -6.005742 -0.902554 1.852978
H  -5.568673 -3.097628 2.922232
H  -3.392047 -4.227279 2.547377
H  -1.687244 -3.213858 1.160817
totalener: -1323.47296729609548 hartree
nucrepener: 3032.08255203791623 hartree
electener: -4355.54132298052355 hartree
oneelecener: -7831.26631483207984 hartree
twoeener: 3475.72499185155584 hartree
cpcmener: -0.01419553448898 hartree
kineticenergy: 1317.78486759370753 hartree
xcener: -128.471608859318 hartree
s2: 2.083035
dispersion: -0.033556524 hartree
s2: 0.000000
energy: -524.8925 -524.7845 -523.2945 -523.1514 -392.2896 -283.5386 -283.4603 -281.1387 -281.0272 -280.9475 -280.8615 -280.7500 -280.5196 -280.3715 -280.3218 -280.2152 -280.1884 -280.1303 -280.1003 -280.0925 -279.8885 -279.8510 -279.8458 -279.8341 -279.8252 -279.8237 -279.8061 -279.7672 -279.3898 -279.3762 -33.8760 -33.5950 -31.2563 -31.1418 -29.1155 -27.3568 -26.7813 -25.8411 -25.1014 -24.9842 -24.4260 -23.7829 -23.6148 -23.1891 -23.1420 -22.7140 -22.5384 -21.6474 -20.5248 -20.2179 -19.9334 -19.6567 -19.2064 -19.0704 -18.8911 -18.1847 -17.9348 -17.6458 -17.2587 -17.1609 -16.9250 -16.5170 -16.3695 -16.2468 -15.9929 -15.8940 -15.7946 -15.7450 -15.2300 -15.1667 -14.9916 -14.8954 -14.6394 -14.4604 -14.4060 -14.3042 -14.1802 -13.8881 -13.7938 -13.7737 -13.5742 -13.4087 -13.2205 -13.1550 -12.9914 -12.8678 -12.7858 -12.5798 -12.4434 -12.3743 -12.1294 -12.0893 -11.9844 -11.8846 -11.5097 -11.3957 -11.2631 -11.0506 -10.7487 -10.5448 -10.1581 -10.0210 -9.6699 -9.5655 -9.4548 -9.3942 -6.7156 -0.7454 1.1301 1.3682 1.5704 1.5901 1.6080 1.7561 1.9036 1.9659 2.0173 2.1018 electronvolt
chargesum: 0.0000000
charge: -0.185360 -0.523888 -0.143276 -0.161330 -0.218467 -0.178328 -0.356304 -0.286801 0.054585 0.169500 0.090073 0.144061 -0.393082 -0.205419 -0.435209 -0.090882 -0.496707 -0.455185 -0.457600 1.041203 0.464689 -0.616919 -0.515985 -0.466956 -0.125198 -0.764437 -0.205230 -0.430214 0.128637 -0.648105 0.119988 0.006164 0.004264 0.750402 0.561734 0.065507 0.250434 0.198237 0.270725 -0.012886 -0.133991 0.259676 0.061303 0.149570 0.315635 0.239315 0.230930 0.232021 -0.056507 0.209269 0.251491 0.668780 0.786959 0.500655 0.338459
charge: 0.355310 -0.319100 0.122363 0.152436 -0.135611 0.183935 0.330830 0.060561 -0.066599 0.181366 -0.202675 -0.745925 0.280355 0.261015 0.333679 -0.740145 0.278567 0.262548 0.333952 0.049970 -0.000887 -0.076206 -0.137804 0.125170 0.083591 0.079886 0.083586 0.129981 -0.228148 0.330549 -0.073351 -0.082909 -0.065275 -0.055374 -0.046132 -0.049949 -0.099810 -0.106809 -0.051020 -0.013250 -0.024259 -0.014236 -0.049490 -0.065980 -0.047005 -0.049434 -0.048070 -0.052357 -0.014699 -0.043900 -0.058487 -0.062101 -0.067080 -0.061930 -0.063642
qa: -0.1854 -0.5239 -0.1433 -0.1613 -0.2185 -0.1783 -0.3563 -0.2868 0.0546 0.1695 0.0901 0.1441 -0.3931 -0.2054 -0.4352 -0.0909 -0.4967 -0.4552 -0.4576 1.0412 0.4647 -0.6169 -0.5160 -0.4670 -0.1252 -0.7644 -0.2052 -0.4302 0.1286 -0.6481 0.1200 0.0062 0.0043 0.7504 0.5617 0.0655 0.2504 0.1982 0.2707 -0.0129 -0.1340 0.2597 0.0613 0.1496 0.3156 0.2393 0.2309 0.2320 -0.0565 0.2093 0.2515 0.6688 0.7870 0.5007 0.3385
va: 3.7890 4.8596 3.9179 3.8664 3.2865 3.5883 3.8892 3.8989 2.7263 2.3430 1.9932 3.7457 1.9340 3.6810 2.1425 3.5746 1.8654 3.6921 2.0761 0.2251 0.6068 2.7274 3.9154 3.8992 3.7343 4.5360 3.9879 3.5951 1.8940 2.1397 1.1315 1.1653 1.3888 0.2035 0.5305 1.0069 0.9835 1.1424 0.7089 0.9471 0.9846 0.7484 1.3596 1.3111 1.3045 1.1791 1.2101 1.4828 0.9808 0.6677 0.9600 0.2949 0.0249 0.6138 0.8591
s2: 2.087701
dispersion: -0.033569326 hartree
s2: -0.000000
s2: 2.096245
dispersion: -0.033607208 hartree
s2: 2.103658
dispersion: -0.033775181 hartree
s2: 2.108581
dispersion: -0.033675154 hartree
s2: 2.107028
dispersion: -0.033738173 hartree
s2: 2.098526
dispersion: -0.033776867 hartree
s2: 2.091421
dispersion: -0.033727970 hartree
s2: 2.088735
dispersion: -0.033661601 hartree
s2: 0.796922
s2: 2.093518
dispersion: -0.033535065 hartree
s2: 0.828146
s2: 2.100097
dispersion: -0.033585380 hartree
s2: 0.900286
energy: -1323.516793244671 hartree
elementType: C O N H
