program: Orca
programVersion: 6.0.1
elementType: C C C C C C C C C C C C O C O C O C O C C C C C C C C C C N H H H H H H H H H H H H H H H H H H H H H H H H H
formula: C25H25NO4
InChI: InChI=1/C25H25NO4/c1-5-16-14-25(23(27)29-3,24(28)30-4)21-20(16)19(17-9-7-6-8-10-17)13-18-12-11-15(2)26-22(18)21/h5-13,16,20-21H,1,14H2,2-4H3
55 atoms
C  1.22799 4.191423 2.352515
C  0.373684 3.329847 1.474001
C  -0.691443 3.86546 0.734239
C  -1.512483 3.024051 0.034791
C  -1.281429 1.627712 0.085259
C  -2.099982 0.665903 -0.479108
C  -1.305285 -0.78744 -3.695203
C  -1.134187 -1.532617 -2.61379
C  -0.006302 -1.420772 -1.6334
C  0.999331 -0.299698 -1.869792
C  1.699338 -0.168008 -0.512649
C  2.573411 1.076698 -0.43846
O  3.510185 0.958968 0.496687
C  4.37923 2.078959 0.664444
O  2.437239 2.04446 -1.137407
C  2.581021 -1.394743 -0.262225
O  3.521617 -1.498756 -1.197662
C  4.428655 -2.595239 -1.063333
O  2.447003 -2.180765 0.637015
C  0.501113 -0.186088 0.485446
C  -0.476568 -1.221145 -0.148182
C  -1.881182 -0.748759 -0.005016
C  -2.896308 -1.44488 0.656824
C  -4.176581 -0.8461 0.849116
C  -5.194555 -1.514097 1.493014
C  -5.012332 -2.818338 1.947737
C  -3.778164 -3.440608 1.752243
C  -2.742097 -2.77924 1.135594
C  -0.073264 1.202515 0.715822
N  0.687487 2.034285 1.409279
H  0.944996 5.23957 2.282724
H  2.278039 4.092446 2.079323
H  1.13346 3.874103 3.391943
H  -0.870519 4.931814 0.744506
H  -2.362065 3.405316 -0.517489
H  -2.843566 0.92482 -1.220339
H  -0.618286 0.005736 -3.963289
H  -2.148529 -0.947371 -4.353973
H  -1.856617 -2.31362 -2.394598
H  0.531899 -2.373432 -1.665967
H  0.494185 0.644409 -2.075181
H  1.693518 -0.495481 -2.6840
H  5.025364 1.829697 1.499137
H  3.801104 2.97371 0.883228
H  4.965392 2.238783 -0.238546
H  3.889732 -3.539344 -1.107798
H  4.963828 -2.526796 -0.118372
H  5.11724 -2.511482 -1.897316
H  0.849626 -0.554204 1.447662
H  -0.344268 -2.155186 0.386802
H  -4.352886 0.153399 0.476271
H  -6.150016 -1.023926 1.629737
H  -5.81939 -3.34594 2.437588
H  -3.627349 -4.455471 2.097404
H  -1.800035 -3.294536 1.012742
elementType: C O N H
totalener: -1323.47357259397154 hartree
nucrepener: 3033.87317931302596 hartree
electener: -4357.33274496910781 hartree
oneelecener: -7834.85087523957191 hartree
twoeener: 3477.51813027046410 hartree
cpcmener: -0.01401069298760 hartree
kineticenergy: 1317.73776478769241 hartree
xcener: -128.463515148055 hartree
s2: 2.103605
energy: -524.8877 -524.7855 -523.2889 -523.1471 -392.3574 -283.5319 -283.4682 -281.1385 -281.0760 -281.0465 -280.9674 -280.9154 -280.3358 -280.3275 -280.2333 -280.1831 -280.1108 -280.1102 -280.1037 -280.0982 -279.8490 -279.8234 -279.8103 -279.7931 -279.7858 -279.7655 -279.7323 -279.7252 -279.4699 -279.4120 -33.8705 -33.5914 -31.2519 -31.1414 -29.2422 -27.4051 -26.7221 -25.9555 -25.1388 -25.0977 -24.4966 -23.8091 -23.5856 -23.2434 -23.1978 -22.7830 -22.5514 -21.6921 -20.5966 -20.3974 -19.9611 -19.6860 -19.2132 -19.0690 -18.8918 -18.2000 -17.9737 -17.6616 -17.2536 -17.1751 -16.9688 -16.5800 -16.3847 -16.2817 -16.0327 -15.9372 -15.8108 -15.7845 -15.3305 -15.1886 -14.9609 -14.8605 -14.6685 -14.5838 -14.3957 -14.3444 -14.1512 -13.9272 -13.8542 -13.7890 -13.5878 -13.5362 -13.2850 -13.1633 -13.0710 -12.9695 -12.7950 -12.6081 -12.5167 -12.4234 -12.2006 -12.1391 -12.0062 -11.8281 -11.5163 -11.4239 -11.2655 -11.0666 -10.7955 -10.7455 -10.3195 -10.1554 -9.9698 -9.6225 -9.5868 -9.5638 -7.5324 -6.4589 0.9412 1.3659 1.5712 1.5831 1.6420 1.7487 1.8367 1.9624 1.9879 2.0418 2.1019 electronvolt
energy: -524.8873 -524.7853 -523.2888 -523.1471 -392.4072 -283.5318 -283.4679 -281.1385 -281.0464 -280.9998 -280.9092 -280.8908 -280.3271 -280.2313 -280.1671 -280.1631 -280.1441 -280.1160 -280.0819 -279.9237 -279.8859 -279.8229 -279.7936 -279.7766 -279.7702 -279.7390 -279.7101 -279.6850 -279.4746 -279.4095 -33.8694 -33.5908 -31.2513 -31.1410 -29.1792 -27.2624 -26.6049 -25.7117 -25.0582 -24.9794 -24.3284 -23.7469 -23.4900 -23.1932 -23.0333 -22.6931 -22.4926 -21.4349 -20.5063 -20.0872 -19.9059 -19.5755 -19.1188 -18.9550 -18.8355 -18.1643 -17.9335 -17.5742 -17.1966 -17.0604 -16.9220 -16.5171 -16.3241 -16.2098 -15.9797 -15.8811 -15.7952 -15.7157 -15.2433 -15.0821 -14.8732 -14.7959 -14.5557 -14.4050 -14.3425 -14.2244 -14.0854 -13.8653 -13.7861 -13.7722 -13.4700 -13.4508 -13.1313 -12.9753 -12.9431 -12.8988 -12.7575 -12.5673 -12.3872 -12.2857 -12.1262 -12.0613 -11.8994 -11.7960 -11.4417 -11.3168 -11.1257 -11.0613 -10.7417 -10.3702 -10.1546 -9.7034 -9.6880 -9.6000 -9.2859 -9.2169 -0.9571 0.1272 1.2903 1.3764 1.5832 1.5992 1.7755 1.8203 1.9356 1.9857 2.0270 electronvolt
chargesum: -0.0000000
charge: -0.195424 -0.477362 -0.094925 -0.232886 -0.195136 -0.339197 -0.289593 -0.443290 0.027194 0.003164 0.479302 0.124306 -0.393963 -0.235398 -0.422304 -0.081110 -0.522348 -0.402740 -0.463390 0.892249 0.462477 -0.681200 -0.380093 -0.498356 -0.139335 -0.766963 -0.170814 -0.345521 0.201305 -0.622441 0.113897 -0.047217 0.006059 0.671102 0.533534 0.118493 0.214114 0.249102 0.239929 0.042810 -0.105561 0.238969 0.116587 0.121528 0.333121 0.247670 0.231706 0.191214 -0.033418 0.204544 0.230298 0.661558 0.740800 0.511673 0.371279
charge: 0.360361 -0.308663 0.125048 0.159642 -0.142091 0.183419 0.333178 0.062918 -0.055088 0.182189 -0.203801 -0.746460 0.280555 0.260955 0.332134 -0.740027 0.278872 0.262237 0.334263 0.036267 -0.013645 -0.076282 -0.148911 0.126155 0.076782 0.078970 0.076940 0.129001 -0.202840 0.329078 -0.072189 -0.083486 -0.062616 -0.054866 -0.044728 -0.051213 -0.098705 -0.104788 -0.051096 -0.014504 -0.027858 -0.014766 -0.049320 -0.069006 -0.046273 -0.049463 -0.048072 -0.052221 -0.011244 -0.041044 -0.064043 -0.063186 -0.070414 -0.062954 -0.063106
qa: -0.1954 -0.4774 -0.0949 -0.2329 -0.1951 -0.3392 -0.2896 -0.4433 0.0272 0.0032 0.4793 0.1243 -0.3940 -0.2354 -0.4223 -0.0811 -0.5223 -0.4027 -0.4634 0.8922 0.4625 -0.6812 -0.3801 -0.4984 -0.1393 -0.7670 -0.1708 -0.3455 0.2013 -0.6224 0.1139 -0.0472 0.0061 0.6711 0.5335 0.1185 0.2141 0.2491 0.2399 0.0428 -0.1056 0.2390 0.1166 0.1215 0.3331 0.2477 0.2317 0.1912 -0.0334 0.2045 0.2303 0.6616 0.7408 0.5117 0.3713
va: 3.8895 4.8382 3.8609 3.8950 3.2428 3.3235 3.8819 4.0647 2.5869 2.6967 1.5211 3.6252 1.9058 3.6711 2.1229 3.3905 1.9377 3.7000 2.0821 0.4718 0.3803 2.3836 3.9495 3.7741 3.8323 4.5223 3.8892 3.2964 2.1963 2.1153 1.0458 1.2508 1.3813 0.2802 0.5497 0.9691 1.0143 1.0780 0.7678 0.9189 0.9576 0.7596 1.3276 1.3531 1.2986 1.1484 1.1799 1.5042 0.9294 0.6582 1.0346 0.3117 0.1461 0.5480 0.7861
dispersion: -0.033775182 hartree
energy: -1323.507347775756 hartree
dipole: 1.902551373 -1.589276482 0.313274891 1.149015837 -0.904794222 0.244221615 -2.844984844 2.483274051 -0.361710793
dipolemethod: SCF
magnitude: 0.537233704 au
magnitude: 1.365539554 debye
