program: Gaussian 16
title: Title Card Required
version: ES64L-G16RevC.01
method: RwB97XD
basis: def2TZVPP
operation: Freq
keyword: #N
keyword: Geom=AllCheck
keyword: Guess=TCheck
keyword: SCRF=Check
keyword: GenChk
keyword: RwB97XD/def2TZVPPFreq
converged: YES YES YES YES
title: Mulliken charges:
elementType: C C H H C H H C C O O C C C C H C H C H H H C C C C H C H C H H H
charge: 0.002200 -0.036690 0.066979 0.083050 -0.046229 0.065448 0.084787 0.089759 0.248531 -0.334529 -0.306566 -0.012700 -0.187233 -0.176884 -0.106574 0.106455 -0.109001 0.110918 -0.130652 0.118970 0.120706 0.121271 0.210769 -0.125967 -0.014778 -0.129828 0.113790 -0.185460 0.094652 -0.087408 0.118148 0.115163 0.118904
chargesum: -0.00000
title: Mulliken charges with hydrogens summed into heavy atoms:
elementType: C C C C C O O C C C C C C C C C C C C
charge: 0.002200 0.113339 0.104006 0.089759 0.248531 -0.334529 -0.306566 -0.012700 -0.080778 -0.065966 0.012395 0.011705 -0.009381 0.210769 -0.012176 0.079874 -0.011681 -0.070297 0.031496
1716.lowfreq: -10.1721 -0.4942 -0.0004 -0.0004 0.0003 3.5369 24.2147 38.5120 52.2901
frequency: 24.1955 38.5100 52.2710 59.8992 72.5520 96.3233 154.6919 191.6353 212.4262 271.5899 320.1639 369.3982 397.3796 419.7680 428.7665 431.1697 461.8198 472.5898 517.6959 559.6698 569.7114 614.4985 636.4059 637.9051 711.4279 719.1944 723.9117 765.1852 780.0011 800.2979 820.1654 843.6055 861.7836 863.7340 872.0395 903.9585 932.9979 952.3561 969.0066 1007.5284 1012.0354 1016.6308 1025.3405 1027.8488 1031.1829 1031.9638 1058.0587 1063.0982 1073.7520 1100.6420 1106.2385 1111.0897 1128.4871 1138.0842 1154.9922 1179.5288 1187.3628 1191.0598 1200.3662 1223.4490 1254.3813 1287.3000 1330.1070 1334.9855 1357.8361 1370.2372 1385.5333 1451.0587 1493.2545 1500.2770 1505.4408 1535.1410 1546.0561 1569.8135 1653.5837 1672.5485 1676.5039 1681.8642 1824.4109 3114.7887 3118.6567 3196.6961 3197.3638 3204.9077 3206.5210 3214.1529 3215.2423 3220.5112 3222.4570 3222.7709 3224.8361 3228.8850 3229.1504
redmass: 3.7891 5.5634 3.9557 6.0103 6.8198 6.4976 5.2069 4.9838 3.3791 5.2371 4.6622 3.9794 3.5996 2.8722 3.0104 5.6638 3.9889 3.3146 3.2742 3.7719 3.9131 5.5351 6.4722 6.3997 3.9364 1.8960 1.9435 2.4886 2.5477 4.7160 3.1416 4.6001 2.5450 1.3585 1.2631 2.0243 1.7796 1.4658 2.0195 1.3618 1.3904 1.3533 1.3267 5.0575 1.3588 5.5210 2.0267 2.4121 1.6836 1.9003 1.3377 1.4629 1.5650 1.5950 1.6495 3.4612 1.1532 1.1439 1.2012 1.1388 4.4212 4.4427 3.2182 4.8676 1.6312 1.4461 3.7266 2.1551 1.3949 1.7503 2.3227 1.6299 2.4042 2.5427 5.6751 6.2317 6.2302 5.7425 12.8252 1.0603 1.0605 1.0856 1.0858 1.0888 1.0893 1.0935 1.0929 1.1019 1.1038 1.1006 1.1037 1.0980 1.0982
irintensity: 0.1133 0.1491 0.1444 0.2899 2.1902 2.0950 0.9071 0.1506 0.0771 1.8703 3.5392 0.9337 4.7435 0.0930 0.4795 7.3559 7.9616 5.6633 6.9341 3.2078 8.8925 2.4539 0.3461 0.1002 3.8203 27.0301 35.2031 23.1727 15.4877 91.2695 9.9139 0.5496 10.4154 3.6028 0.6178 0.6532 22.4636 2.6218 16.1601 0.1960 0.2004 2.1690 0.4530 0.0579 0.0162 3.6290 4.3158 6.3626 6.4418 18.8891 1.5529 6.5453 39.2726 5.6620 9.2629 253.7849 0.2061 0.3749 57.5305 2.2625 297.9481 4.6412 1.7672 0.7470 0.2620 3.0619 140.1299 91.3697 0.8166 15.6973 2.9744 19.7643 54.6613 15.6916 1.4939 6.9294 16.8193 17.5433 273.7197 51.5608 17.5212 1.0335 0.0668 1.8971 7.1417 16.2648 7.3471 8.6418 9.8883 2.3753 6.1346 6.4324 4.7288
temp: 298.150 k
press: 1.00000 atm
elementType: 6 6 1 1 6 1 1 6 6 8 8 6 6 6 6 1 6 1 6 1 1 1 6 6 6 6 1 6 1 6 1 1 1
symmnumber: 1
zpe: 698898.6 jmol-1
zpe.correction: 0.266196 hartree
zpe.thermalcorrener: 0.281304 hartree
zpe.thermalcorrenthalpy: 0.282248 hartree
zpe.thermalcorrgfe: 0.221779 hartree
zpe.sumelectzpe: -806.391459 hartree
zpe.sumelectthermal: -806.376352 hartree
zpe.sumelectthermalent: -806.375408 hartree
zpe.sumelectthermalfe: -806.435876 hartree
dipole: 2.0493 0.2242 0.0326
dipole: 2.0618
quadrupole: -110.9883 -102.0352 -99.6996
quadrupole: -1.8693 -5.5824 2.7891
quadrupole: -6.7472 2.2058 4.5414 -1.8693 -5.5824 2.7891
hfenergy: -806.6576556 hartree
pointgroup: C01 [X(C17H14O2)]
dipole: 0.8062462 0.0881906 0.0128435 debye
polarizability: 167.0989687|5.3684547|197.0439788|-20.7764998|14.5384818|199.8077375 unknown
InChI: InChI=1/C17H14O2/c18-15(19-14-9-5-2-6-10-14)17-11-16(17,12-17)13-7-3-1-4-8-13/h1-10H,11-12H2
charge 0 multiplicity 1
33 atoms
C  -0.16499425 0.74957218 -0.202999
C  1.18864189 0.96983168 0.3974691
H  1.24898933 1.63992059 1.24978644
H  1.84451282 0.11015738 0.44389126
C  -0.42826101 2.139965 -0.67267003
H  -0.49722189 2.92216323 0.07727933
H  -1.11403865 2.24414862 -1.50343348
C  0.9098627 1.53872315 -0.94963367
C  -0.69305707 -0.44733873 -0.84935206
O  -1.64101441 -0.46825477 -1.58270532
O  0.08117075 -1.52732001 -0.57527308
C  1.51644294 1.14459292 -2.22809705
C  2.78263539 0.56304306 -2.25003356
C  0.82613237 1.28833706 -3.43146788
C  3.33472135 0.11441884 -3.43888127
H  3.33988737 0.46120618 -1.32875525
C  1.37924466 0.83852688 -4.61817127
H  -0.15714649 1.73732127 -3.4411049
C  2.63368625 0.24607064 -4.62741475
H  4.31712044 -0.33864422 -3.43501462
H  0.82444831 0.94858463 -5.54032117
H  3.06389912 -0.10422977 -5.55597193
C  -0.077994 -2.65031243 -1.37608764
C  -0.6726985 -3.77456312 -0.83927143
C  0.42573215 -2.64015698 -2.66484533
C  -0.76513296 -4.92088887 -1.61490832
H  -1.05546194 -3.74462428 0.17132618
C  0.32418367 -3.78910128 -3.43112134
H  0.88694108 -1.74176633 -3.05504617
C  -0.26929736 -4.93016576 -2.90931926
H  -1.22889837 -5.80773067 -1.20432484
H  0.71268941 -3.79175845 -4.4407165
H  -0.34424307 -5.82543065 -3.51158519
