program: Gaussian 16
title: Title Card Required
version: ES64L-G16RevC.01
method: UwB97XD
basis: def2TZVPP
operation: Freq
keyword: #N
keyword: Geom=AllCheck
keyword: Guess=TCheck
keyword: SCRF=Check
keyword: GenChk
keyword: UwB97XD/def2TZVPP
keyword: Freq
converged: YES YES YES YES
elementType: C
elementType: H
elementType: O
elementType: S
elementType: F
1716.lowfreq: -277.3867 -1.5666 -0.0020 -0.0005 0.0010 3.2687 9.7819 26.9435 38.8620
frequency: -277.3866 26.8763 38.8592 44.5666 57.2221 60.5062 73.0481 119.5380 124.9078 133.0371 149.2066 181.6263 202.1931 234.4413 244.9345 284.9447 334.9086 335.7290 337.9598 359.5628 390.8276 418.9047 426.1636 433.2436 482.7857 510.8194 514.2901 517.9240 532.5412 540.9849 554.9476 569.1106 618.8397 638.3236 712.5338 719.4592 756.4611 757.5551 779.7762 802.7222 820.7566 844.7955 867.1154 887.8945 908.0980 953.4828 997.3168 1011.1338 1028.9325 1033.8346 1034.1089 1052.7585 1064.4808 1085.2433 1127.5861 1137.7442 1161.0428 1178.8932 1188.5509 1193.1271 1214.8379 1227.1610 1259.5914 1296.0923 1335.4290 1373.3441 1374.4433 1412.9186 1488.5046 1491.8932 1494.0413 1501.8000 1503.2876 1520.3939 1555.0807 1657.3382 1681.3056 1806.6340 3072.1989 3136.2417 3138.2741 3153.6155 3187.8711 3199.2084 3208.2148 3217.3388 3224.3381 3229.5317 3234.4639 3235.6456
redmass: 12.2420 9.0215 4.3756 4.1966 6.6028 6.6172 6.4650 7.5261 6.2909 4.5601 1.4753 4.0428 4.4504 3.1961 4.7608 17.4639 13.8230 4.5034 17.2023 6.2678 2.9181 2.8407 17.6547 3.9480 3.9548 5.3223 19.1384 12.9970 7.4149 18.8687 4.2936 10.2959 3.5118 6.4143 3.1807 1.8909 23.5305 19.2857 4.2890 2.9327 7.2347 4.3207 1.2971 4.0927 2.6886 1.4507 1.4166 1.3840 3.9612 1.4220 1.4443 2.8818 2.4162 1.9902 1.4187 1.8536 1.3352 1.3790 1.2874 1.1474 1.5759 1.1625 3.6639 4.5289 4.6321 1.4812 3.0079 2.9770 1.2099 1.2642 1.0445 2.1327 1.0531 1.3147 2.3300 5.6683 5.6966 11.7441 1.0304 1.0587 1.0589 1.1071 1.1066 1.0859 1.0889 1.0927 1.0964 1.1027 1.1071 1.1106
irintensity: 592.2083 0.0576 0.3173 0.1389 1.0382 1.0754 2.5199 2.8620 1.0529 4.3332 6.0544 26.3295 1.7218 13.8890 120.9189 3.6963 3.4690 17.4136 1.1642 92.3649 3.5674 0.0316 0.0538 4.8515 42.6630 87.6587 1.0247 2.5157 134.1336 6.3945 5.0174 4.2169 7.4926 0.1541 3.4339 42.7492 360.8777 350.0165 18.3095 169.5569 519.5187 120.6742 0.9628 3.0943 12.2693 1.7911 2.0302 0.0503 0.2552 1.7684 0.7472 9.2941 7.2400 1.3667 3.8161 23.1125 1.4940 19.7871 1.4356 0.0220 48.1194 0.5948 328.5202 7.1250 0.1657 7.3967 70.3018 220.5612 31.8011 38.0040 8.2738 16.0892 7.4120 9.0727 7.0324 1.0619 2.5903 268.9462 28.1143 2.9019 3.1158 12.7671 9.3554 0.6522 2.7561 12.3846 9.8445 2.7056 1.8910 1.4860
temp: 298.150 k
press: 1.00000 atm
elementType: 6 6 1 1 6 1 1 6 6 8 8 6 1 1 1 6 6 6 6 1 6 1 6 1 1 1 16 9 9 9 9 9
symmnumber: 1
zpe: 598313.6 jmol-1
zpe.correction: 0.227886 hartree
zpe.thermalcorrener: 0.247015 hartree
zpe.thermalcorrenthalpy: 0.247959 hartree
zpe.thermalcorrgfe: 0.178235 hartree
zpe.sumelectzpe: -1512.101541 hartree
zpe.sumelectthermal: -1512.082411 hartree
zpe.sumelectthermalent: -1512.081467 hartree
zpe.sumelectthermalfe: -1512.151192 hartree
dipole: -0.8933 -4.3571 -1.0663
dipole: 4.5738
quadrupole: -129.4359 -128.4397 -110.4267
quadrupole: -14.0468 -4.1979 3.3062
quadrupole: -6.6685 -5.6723 12.3408 -14.0468 -4.1979 3.3062
hfenergy: -1512.3294265 hartree
pointgroup: C01 [X(C12H12F5O2S1)]
dipole: -0.3514537 -1.7142229 -0.4195168 debye
polarizability: 179.5293165|31.2739135|203.2725131|0.6288808|20.7949306|184.2712418 unknown
InChI: InChI=1/C12H12O2.F5S/c1-14-10(13)12-7-11(12,8-12)9-5-3-2-4-6-9;1-6(2,3,4)5/h2-6H,7-8H2,1H3;
charge 0 multiplicity 2
32 atoms
C  -0.05229895 0.80120229 -0.31969416
C  1.33316439 0.80747496 0.18342994
H  1.52019038 1.33164441 1.11445793
H  1.9117763 -0.09716375 0.05516812
C  -0.23792652 2.23075544 -0.61236592
H  -0.22559653 2.91937434 0.22535498
H  -0.94891495 2.47867716 -1.3893885
C  1.13590922 1.71432923 -1.02377217
C  -0.68636286 -0.25575716 -1.12725277
O  -1.65248557 -0.07308319 -1.82002497
O  -0.05138113 -1.42191651 -1.00214089
C  -0.55171421 -2.48501898 -1.81149662
H  0.0708536 -3.34499822 -1.5860818
H  -0.47520345 -2.22337573 -2.86574183
H  -1.59249429 -2.69175598 -1.56807523
C  1.52974051 1.36284694 -2.40054431
C  2.59078866 0.48865641 -2.62595152
C  0.8696766 1.91957253 -3.49290703
C  2.96440764 0.15746711 -3.91626165
H  3.14240882 0.08218467 -1.78963646
C  1.24488718 1.58605818 -4.7824087
H  0.06618438 2.62564492 -3.33815468
C  2.28990425 0.70127063 -4.99898948
H  3.79249557 -0.51977114 -4.07641978
H  0.72189848 2.02497863 -5.62118912
H  2.58536925 0.44572931 -6.00762997
S  2.64448179 3.6663335 -0.51339404
F  3.79403911 2.64802855 0.04646197
F  3.55460454 4.87533252 -0.12954694
F  3.33227966 3.64299811 -1.97940603
F  1.98602065 3.74370012 0.99325792
F  1.51436451 4.71125867 -1.05618929
