program: Gaussian 16
title: Title Card Required
version: ES64L-G16RevC.01
method: UwB97XD
basis: def2TZVPP
operation: Freq
keyword: #N
keyword: Geom=AllCheck
keyword: Guess=TCheck
keyword: SCRF=Check
keyword: GenChk
keyword: UwB97XD/def2TZVPP
keyword: Freq
converged: YES YES YES YES
elementType: C
elementType: H
elementType: S
elementType: F
elementType: Cl
elementType: O
1716.lowfreq: -356.2471 -5.2794 -2.2121 0.0000 0.0015 0.0022 2.0209 23.2008 30.0348
frequency: -356.2471 23.1736 30.0334 30.6315 38.9893 49.6011 54.2388 69.0476 75.1930 85.0541 101.6216 106.3449 128.9762 163.3914 169.2815 185.1838 211.8208 217.7302 222.0145 225.2559 235.0421 259.8033 305.8525 313.8085 333.1312 343.3477 351.8022 386.9493 387.5293 393.0625 413.5750 414.8647 419.0914 453.7365 464.5494 466.9648 482.5834 529.1097 548.0449 548.9012 549.2897 563.8487 574.3282 584.0664 585.8138 597.4296 606.6304 612.6126 633.3693 662.8695 688.2640 696.0031 709.8099 761.5464 794.6231 827.6778 834.6188 837.7288 841.1424 851.4342 864.2234 867.4407 878.7134 882.9786 901.0316 958.0247 999.3361 1015.3572 1018.1308 1026.3874 1036.8419 1058.3201 1084.2881 1090.3417 1100.2816 1118.5299 1127.0729 1177.9553 1190.8846 1191.9574 1212.8239 1213.7741 1247.8104 1261.0634 1279.3755 1338.0305 1338.9704 1367.0958 1408.9822 1457.1580 1475.0498 1489.4934 1494.4105 1498.8244 1505.4828 1542.1480 1641.0428 1656.4804 1846.2449 3080.9626 3108.9123 3114.3983 3168.3342 3169.5171 3177.6806 3197.1351 3198.6266 3202.4371 3210.3535 3219.9848 3228.7267
redmass: 15.4032 12.0830 10.2850 11.3000 8.8008 6.9725 4.9158 7.0231 5.7561 5.4369 15.5657 8.8482 5.5400 5.3820 1.2047 5.8275 6.0919 7.2930 8.6074 20.1846 9.3265 7.3080 18.8928 4.9280 3.4014 3.8872 13.4736 18.0119 11.8496 2.5964 3.4322 6.0509 15.4194 5.1699 5.9908 18.8693 18.2237 3.0360 15.0868 12.7467 6.7313 17.1411 17.9151 8.1279 18.9834 18.4328 18.0365 17.7984 6.4373 9.1461 6.1740 4.8786 1.6483 5.0335 1.9470 1.5140 20.3485 24.3862 23.2788 12.0823 4.2204 1.3197 11.5421 15.0249 5.5465 1.4173 3.4849 1.3808 5.4559 5.5763 1.3440 2.2325 2.3472 2.5141 1.3376 2.4838 2.4080 3.2143 1.2828 1.1977 1.1478 1.5254 1.8502 1.4091 1.8428 4.2981 4.3075 1.4769 3.5427 1.0797 1.1254 1.2234 1.0426 2.3413 1.0474 2.3721 5.3261 5.3628 11.9584 1.0305 1.0593 1.0617 1.1061 1.1061 1.1043 1.1075 1.0864 1.0884 1.0917 1.0954 1.0990
irintensity: 160.9427 0.1710 0.0663 0.0239 0.3477 0.1893 0.2327 0.3589 2.1937 1.5540 1.2124 0.5444 0.5178 1.6191 0.7455 0.4202 3.5292 2.3602 1.4769 0.8081 0.2869 1.4060 0.0030 7.6600 2.0238 11.2536 0.2267 0.2092 0.4870 1.7987 0.0609 0.4945 2.2230 0.9918 37.1194 0.2659 0.0140 41.7072 4.7160 5.5852 1.2569 281.5664 12.0266 2.4472 0.2669 5.5337 31.4503 14.8053 0.1957 43.5575 3.5027 3.7262 44.2973 11.1014 18.1398 2.6446 634.5997 478.0531 322.7143 278.2776 17.6307 9.6660 311.5161 300.0645 82.6658 0.0900 10.9819 0.0365 9.4660 5.8859 0.0490 3.6072 3.4962 0.7842 1.9061 0.8506 8.9321 1.6068 0.8632 0.3845 9.9941 44.8496 80.0045 0.2575 9.3317 94.6873 114.3806 2.9404 116.7010 25.9387 4.5435 19.6648 11.1189 9.7461 7.7734 1.4225 0.7267 16.1239 191.6623 26.1074 3.0237 7.8814 6.7573 1.9388 1.5405 6.3676 2.1778 0.0370 2.9530 10.4846 11.0929
temp: 298.150 k
press: 1.00000 atm
elementType: 6 6 6 6 1 1 1 1 16 9 9 9 9 9 16 9 9 9 9 9 17 6 6 6 6 1 6 1 6 1 1 1 6 8 8 6 1 1 1
symmnumber: 1
zpe: 657897.5 jmol-1
zpe.correction: 0.250580 hartree
zpe.thermalcorrener: 0.276663 hartree
zpe.thermalcorrenthalpy: 0.277607 hartree
zpe.thermalcorrgfe: 0.191661 hartree
zpe.sumelectzpe: -2869.756802 hartree
zpe.sumelectthermal: -2869.730719 hartree
zpe.sumelectthermalent: -2869.729775 hartree
zpe.sumelectthermalfe: -2869.815721 hartree
dipole: 2.3073 -3.3927 1.2819
dipole: 4.2985
quadrupole: -191.3936 -157.8920 -164.2418
quadrupole: -10.1957 -3.3885 7.3462
quadrupole: -20.2178 13.2838 6.9340 -10.1957 -3.3885 7.3462
hfenergy: -2870.0073818 hartree
pointgroup: C01 [X(C12H12Cl1F10O2S2)]
dipole: 0.9077512 -1.3348001 0.5043343 debye
polarizability: 279.6467511|-43.887896|267.6917704|-9.2069888|11.0875481|180.2721239 unknown
InChI: InChI=1/C12H12F5O2S.ClF5S/c1-19-11(18)12(20(13,14,15,16)17)7-10(8-12)9-5-3-2-4-6-9;1-7(2,3,4,5)6/h2-6H,7-8H2,1H3;
charge 0 multiplicity 2
39 atoms
C  0.649671 0.515121 -0.978673
C  0.218111 -0.514701 0.042503
C  0.6271 0.370853 1.198753
C  0.798339 1.527886 0.181916
H  -0.055879 0.815172 -1.748542
H  1.59326 0.235184 -1.442866
H  -0.090249 0.548761 1.993658
H  1.567066 0.035734 1.633006
S  2.430589 2.421625 0.2652
F  3.214234 1.028537 0.166972
F  2.481269 2.572117 -1.316399
F  1.768433 3.863218 0.374396
F  2.456037 2.328654 1.85553
F  3.841911 3.128423 0.332368
S  -4.25371 0.226517 0.249846
F  -4.526544 -1.115867 1.076406
F  -3.977475 1.012771 1.623773
F  -4.016733 1.583122 -0.565942
F  -4.564966 -0.543804 -1.11481
F  -5.772759 0.589774 0.374468
Cl -2.05071 -0.291918 0.086142
C  0.341932 -1.94454 -0.052429
C  0.408463 -2.568315 -1.303941
C  0.383273 -2.731848 1.104478
C  0.524238 -3.941391 -1.392979
H  0.363986 -1.967718 -2.203212
C  0.499311 -4.104358 1.009681
H  0.318365 -2.258292 2.07554
C  0.570013 -4.712021 -0.237871
H  0.577311 -4.416219 -2.363144
H  0.532742 -4.706101 1.907625
H  0.659452 -5.787564 -0.309886
C  -0.341673 2.551716 0.16974
O  -0.80239 3.000698 -0.838695
O  -0.739024 2.852961 1.396043
C  -1.793547 3.815037 1.486018
H  -2.010628 3.912793 2.544441
H  -2.668808 3.462782 0.945179
H  -1.46501 4.766149 1.070487
