program: Gaussian 16
title: Title Card Required
version: ES64L-G16RevC.01
method: RwB97XD
basis: def2TZVPP
operation: Freq
keyword: #N
keyword: Geom=AllCheck
keyword: Guess=TCheck
keyword: SCRF=Check
keyword: GenChk
keyword: RwB97XD/def2TZVPP
keyword: Freq
converged: YES YES YES YES
title: Mulliken charges:
elementType: C C C C H H H H S F F F F F Cl C C C C H C H C H H C O C F F F H H H
charge: -0.203904 0.219800 -0.226895 0.090544 0.103751 0.118540 0.102290 0.115728 0.966504 -0.218311 -0.213779 -0.214249 -0.240161 -0.212902 -0.124549 0.030989 -0.183533 -0.186119 -0.111922 0.124972 -0.120028 0.126870 -0.053347 0.130804 0.125801 -0.039504 -0.335720 0.558601 -0.180412 -0.180324 -0.176605 0.184543 0.100607 0.121921
chargesum: -0.00000
title: Mulliken charges with hydrogens summed into heavy atoms:
elementType: C C C C S F F F F F Cl C C C C C C C O C F F F
charge: 0.018387 0.219800 -0.008877 0.090544 0.966504 -0.218311 -0.213779 -0.214249 -0.240161 -0.212902 -0.124549 0.030989 -0.058561 -0.059250 0.018882 0.005773 -0.053347 0.183024 -0.151177 0.558601 -0.180412 -0.180324 -0.176605
chargesum: 0.00000
1716.lowfreq: -57.0769 -8.0564 -1.7770 -0.0020 -0.0011 -0.0006 3.4519 12.7869 24.4134
frequency: -57.0722 12.1485 24.3770 38.9244 64.4532 73.6167 120.2333 130.8615 149.1290 174.1100 194.9067 207.9363 222.8194 236.9151 277.8575 284.6942 323.3145 337.5065 362.5658 376.0956 381.4851 401.3413 406.6790 411.0932 416.8832 432.3463 440.0786 470.7781 495.2072 507.0450 534.1767 564.4093 584.3478 586.1267 589.3804 593.6360 604.8951 618.5255 654.4235 658.0416 666.2422 730.5710 781.5446 791.6966 814.8140 847.9428 853.6127 859.6754 869.3191 874.0977 881.5865 892.4885 931.7166 1006.6424 1019.3501 1020.5802 1047.2815 1064.1703 1096.6825 1108.8568 1116.9101 1134.5556 1150.3716 1160.7097 1164.9995 1170.9500 1203.8779 1230.3168 1247.0493 1283.1318 1287.9888 1297.7543 1338.7956 1344.7559 1356.8425 1360.0582 1392.7498 1447.1514 1463.1116 1481.6208 1496.8402 1500.9875 1576.0559 1656.9462 1698.1841 3090.8395 3121.1311 3138.2521 3139.9670 3205.3606 3205.9600 3210.5172 3216.5351 3228.0574 3233.1774 3929.0042
redmass: 13.1717 18.1072 13.4148 4.1408 7.1662 7.1976 5.9854 11.8993 11.0761 8.1792 8.4649 12.9287 6.4800 6.8025 5.4962 5.2188 4.0141 3.7142 3.7613 1.6299 4.4176 3.1765 10.8178 6.2057 2.9120 8.3092 4.6065 18.2363 4.6166 4.5011 5.4677 7.9448 14.4878 11.5315 14.2895 10.1135 5.8079 3.7616 7.1373 8.0916 6.2864 5.2507 4.4706 4.5389 4.2529 3.9562 9.9815 5.4460 5.4577 1.3522 1.6872 2.0943 2.0779 1.4797 2.6569 1.3815 3.3634 7.3576 3.2709 2.7218 6.1053 1.4568 1.9524 2.5320 2.0461 12.1987 5.0967 1.1274 1.3878 1.6086 1.3784 1.9564 7.3610 2.7877 1.3450 2.5479 1.2896 1.1600 2.9417 1.0823 1.1012 1.0819 2.6314 7.0458 5.9778 1.0605 1.0674 1.0674 1.1008 1.0903 1.0899 1.0996 1.1030 1.0948 1.0943 1.0655
irintensity: 0.0532 0.0173 0.1624 0.0299 0.0583 1.0625 2.4125 1.8764 2.6133 0.1971 1.0121 0.3554 0.2836 2.6290 4.4492 0.9397 4.3094 31.8646 53.9484 64.5688 6.7095 3.5677 1.4000 8.2974 0.0377 1.3714 0.9785 0.2116 31.3128 1.4523 11.8079 6.2765 2.5769 1.2561 2.4424 9.3234 6.4697 11.6423 0.0570 2.8906 64.0718 14.5715 9.7960 5.7786 53.7932 53.0446 284.2682 352.5475 311.6064 31.5407 42.2227 11.7095 9.8399 1.3522 6.7380 0.0422 35.3588 6.3998 11.0741 142.0222 51.6457 30.1035 6.3414 61.5907 18.6984 258.8157 165.5028 2.3979 17.2892 6.4901 7.7830 11.8546 13.3920 374.2010 0.3457 54.8537 6.4784 20.0030 22.1631 17.1682 0.4930 14.0766 0.0571 2.9063 17.4436 15.9091 6.1842 2.1353 6.4856 6.5182 1.8628 2.4886 1.0815 1.1221 0.6362 61.6375
temp: 298.150 k
press: 1.00000 atm
elementType: 6 6 6 6 1 1 1 1 16 9 9 9 9 9 17 6 6 6 6 1 6 1 6 1 1 6 8 6 9 9 9 1 1 1
symmnumber: 1
zpe: 606529.1 jmol-1
zpe.correction: 0.231015 hartree
zpe.thermalcorrener: 0.251038 hartree
zpe.thermalcorrenthalpy: 0.251983 hartree
zpe.thermalcorrgfe: 0.180444 hartree
zpe.sumelectzpe: -2196.148393 hartree
zpe.sumelectthermal: -2196.128369 hartree
zpe.sumelectthermalent: -2196.127425 hartree
zpe.sumelectthermalfe: -2196.198964 hartree
dipole: -0.9700 1.0630 0.4114
dipole: 1.4967
quadrupole: -139.9570 -160.2362 -153.0142
quadrupole: 4.1528 -8.2658 -2.8636
quadrupole: 11.1122 -9.1671 -1.9451 4.1528 -8.2658 -2.8636
hfenergy: -2196.3794077 hartree
pointgroup: C01 [X(C12H11Cl1F8O1S1)]
dipole: -0.381615 0.4182292 0.161844 debye
polarizability: 153.227298|-2.664676|211.7702627|-3.0656828|21.765765|160.6405813 unknown
InChI: InChI=1/C12H11ClF8OS/c13-11(8-1-3-9(4-2-8)12(14,15)16)5-10(6-11,7-22)23(17,18,19,20)21/h1-4,22H,5-7H2
charge 0 multiplicity 1
34 atoms
C  1.393134 0.650578 -0.001652
C  0.155278 -0.209219 -0.345605
C  -0.423012 0.084826 1.057555
C  0.661397 1.169436 1.257241
H  1.660552 1.433816 -0.704768
H  2.255553 0.028049 0.199984
H  -1.450033 0.438728 1.10645
H  -0.310236 -0.777841 1.701658
S  1.612768 1.083469 2.896898
F  0.511123 1.975936 3.63659
F  0.87585 -0.229102 3.420005
F  2.779539 0.172248 2.30329
F  2.444251 2.403692 2.495123
F  2.420503 1.095263 4.260862
Cl -0.844724 0.524446 -1.666438
C  0.387787 -1.649876 -0.711885
C  -0.505314 -2.633633 -0.30971
C  1.483808 -2.008439 -1.487353
C  -0.305142 -3.956229 -0.665101
H  -1.372518 -2.369339 0.281179
C  1.689768 -3.327217 -1.846851
H  2.180686 -1.251191 -1.821808
C  0.793914 -4.303335 -1.434438
H  -1.006706 -4.713989 -0.347134
H  2.544604 -3.596085 -2.45152
C  0.083367 2.578451 1.001032
O  0.987711 3.517434 0.493996
C  1.053428 -5.743877 -1.787196
F  -0.05993 -6.484653 -1.741284
F  1.567146 -5.871507 -3.017734
F  1.932166 -6.303969 -0.939592
H  1.599051 3.774084 1.182979
H  -0.657924 2.441708 0.214853
H  -0.443661 2.944431 1.881531
