program: Gaussian 16
title: Title Card Required
version: ES64L-G16RevC.01
method: RwB97XD
basis: def2TZVPP
operation: Freq
keyword: #N
keyword: Geom=AllCheck
keyword: Guess=TCheck
keyword: SCRF=Check
keyword: GenChk
keyword: RwB97XD/def2TZVPP
keyword: Freq
converged: YES YES NO NO
title: Mulliken charges:
elementType: C C C C H H H H S F F F F F Cl C C C C H C H C H H C O C F F F H
charge: -0.205251 0.230864 -0.232133 0.073005 0.118597 0.116160 0.109728 0.116048 0.960751 -0.213995 -0.213922 -0.203451 -0.207756 -0.206955 -0.111188 0.046471 -0.185655 -0.178867 -0.131852 0.124170 -0.104583 0.127218 -0.061690 0.122452 0.135313 0.088462 -0.251190 0.564473 -0.178020 -0.179802 -0.179833 0.112433
chargesum: -0.00000
title: Mulliken charges with hydrogens summed into heavy atoms:
elementType: C C C C S F F F F F Cl C C C C C C C O C F F F
charge: 0.029505 0.230864 -0.006356 0.073005 0.960751 -0.213995 -0.213922 -0.203451 -0.207756 -0.206955 -0.111188 0.046471 -0.061485 -0.051649 -0.009400 0.030730 -0.061690 0.200894 -0.251190 0.564473 -0.178020 -0.179802 -0.179833
chargesum: 0.00000
1716.lowfreq: -7.4182 -3.9982 -2.2415 0.0015 0.0016 0.0022 3.7297 19.6055 34.5387
frequency: -7.0172 19.5991 34.5345 43.6241 59.2567 77.0820 109.2422 123.2578 137.3443 159.2776 172.2714 196.8970 232.8234 246.3976 285.5354 310.7289 323.7775 352.0492 359.3230 370.5868 398.1543 403.9138 415.1689 422.0459 434.2590 440.7017 478.9059 497.4074 516.1027 535.9653 573.5910 578.0530 587.4381 596.7606 607.4555 617.1082 651.2539 654.8844 667.4708 674.7592 739.8026 782.8623 798.4541 815.3762 854.1272 868.0270 872.6938 877.8758 881.1510 887.8727 898.6740 973.0892 1006.7459 1019.6278 1029.5414 1048.8321 1068.5158 1103.7662 1121.1817 1133.1942 1139.2491 1157.5044 1171.2587 1182.1405 1204.1165 1229.2391 1269.3420 1275.3849 1299.5199 1338.4491 1341.7834 1354.4479 1358.3621 1419.3750 1463.0741 1469.1232 1485.5199 1576.1020 1657.5293 1699.0096 1860.0904 2970.0884 3111.0544 3130.9983 3182.3201 3197.2251 3203.6882 3206.8793 3223.7412 3237.6398
redmass: 18.3243 12.9820 6.3641 6.6133 9.9954 8.9324 9.8898 13.1286 12.8072 12.4172 12.6653 9.9199 7.0372 8.0782 8.1143 4.3431 6.7538 2.5412 10.7446 5.3282 2.9421 8.2042 2.9563 14.8471 6.2931 6.1935 18.2187 5.6941 4.4841 5.4016 14.6995 17.2812 11.3209 18.4567 16.6703 3.7516 3.1928 7.0631 12.1625 5.7256 5.3640 4.0321 5.9092 4.0167 5.2626 3.4580 1.3771 3.6862 5.0597 2.4220 2.6630 2.1947 1.4127 1.3762 3.1074 3.1385 5.7707 4.1783 2.4179 1.2551 2.7435 1.7877 12.4754 3.1729 5.2507 1.1267 1.8883 1.3869 1.8754 7.0011 2.5784 1.7275 2.5755 1.1825 2.9219 1.0853 1.1127 2.6584 7.0715 6.0069 10.7693 1.0879 1.0622 1.0593 1.1058 1.1091 1.0890 1.0902 1.0952 1.0940
irintensity: 0.0581 0.2187 0.1379 0.3306 1.4954 1.9802 3.7677 2.1416 1.4721 0.3936 0.7839 0.5861 0.7019 0.6269 1.2426 7.4717 12.7509 2.1142 2.8261 4.7421 10.2286 1.5250 0.2137 0.3149 2.1879 0.5681 0.1036 7.5294 6.2020 11.9824 6.2014 3.5410 0.3819 1.4083 32.7854 10.0026 35.7219 0.5115 5.5964 22.9331 9.3153 3.0385 8.5126 10.6650 253.5756 222.5593 28.0987 346.3389 199.7422 56.5231 78.3008 3.5858 2.3116 0.2293 3.3116 32.3519 5.7113 77.6973 38.7801 1.9400 6.2494 42.9152 257.3932 16.9725 169.0070 2.5485 2.6062 1.5953 24.3684 73.2327 211.1334 44.4598 96.9914 8.9315 25.0337 15.2469 0.1792 0.1525 2.9831 16.2054 150.0159 49.3160 3.6963 4.6697 1.8312 0.1112 3.7708 2.6661 1.3430 0.4512
temp: 298.150 k
press: 1.00000 atm
elementType: 6 6 6 6 1 1 1 1 16 9 9 9 9 9 17 6 6 6 6 1 6 1 6 1 1 6 8 6 9 9 9 1
symmnumber: 1
zpe: 541673.1 jmol-1
zpe.correction: 0.206312 hartree
zpe.thermalcorrener: 0.225876 hartree
zpe.thermalcorrenthalpy: 0.226820 hartree
zpe.thermalcorrgfe: 0.156573 hartree
zpe.sumelectzpe: -2194.957308 hartree
zpe.sumelectthermal: -2194.937744 hartree
zpe.sumelectthermalent: -2194.936800 hartree
zpe.sumelectthermalfe: -2195.007047 hartree
dipole: -1.1810 -0.2182 0.6181
dipole: 1.3507
quadrupole: -136.1735 -165.0434 -151.0141
quadrupole: -0.9538 -7.5440 -3.3739
quadrupole: 14.5702 -14.2998 -0.2704 -0.9538 -7.5440 -3.3739
hfenergy: -2195.1636204 hartree
pointgroup: C01 [X(C12H9Cl1F8O1S1)]
dipole: -0.4646269 -0.0858508 0.2431939 debye
polarizability: 150.4912574|-2.0868623|207.9806673|-5.0670005|19.9703413|156.1263053 unknown
InChI: InChI=1/C12H9ClF8OS/c13-11(8-1-3-9(4-2-8)12(14,15)16)5-10(6-11,7-22)23(17,18,19,20)21/h1-4,7H,5-6H2
charge 0 multiplicity 1
32 atoms
C  1.56325605 0.59299986 0.17156894
C  0.31942988 -0.17740626 -0.32891886
C  -0.39907939 0.14516499 1.0010849
C  0.71973045 1.15907192 1.3243245
H  1.98015692 1.34571772 -0.49051129
H  2.33998427 -0.08783545 0.50427547
H  -1.40301267 0.55813875 0.9291566
H  -0.40702085 -0.70933497 1.67019103
S  1.44951777 1.02783952 3.0248268
F  0.00949374 0.7602549 3.66482111
F  1.67578653 -0.54285297 2.84285102
F  2.913148 1.31553793 2.47554233
F  1.27102173 2.58735493 3.32425031
F  2.06416887 0.88283187 4.46982939
Cl -0.47672068 0.67828578 -1.70888079
C  0.48627847 -1.62174607 -0.70588205
C  -0.52747767 -2.53763077 -0.44705605
C  1.64128944 -2.05325027 -1.34163089
C  -0.38507066 -3.86269897 -0.80985086
H  -1.44006717 -2.21330131 0.03588597
C  1.79077872 -3.38063362 -1.70832851
H  2.4334629 -1.34957635 -1.56141862
C  0.77740708 -4.28540968 -1.44108509
H  -1.17790015 -4.56904529 -0.60478808
H  2.69425767 -3.70675658 -2.20244311
C  0.24989898 2.59869205 1.08932879
O  0.7745784 3.34064738 0.31802738
C  0.91889292 -5.74047682 -1.80187975
F  1.0283526 -6.50735511 -0.70518709
F  -0.14925709 -6.18630812 -2.4789446
F  1.99589878 -5.97696457 -2.55748822
H  -0.65038894 2.88539974 1.66035222
