program: Gaussian 16
title: Title Card Required
version: ES64L-G16RevC.01
method: RwB97XD
basis: def2TZVPP
operation: Freq
keyword: #N
keyword: Geom=AllCheck
keyword: Guess=TCheck
keyword: SCRF=Check
keyword: GenChk
keyword: RwB97XD/def2TZVPP
keyword: Freq
converged: YES YES NO YES
title: Mulliken charges:
elementType: C C C C H H H H S F F F F F Cl C C C C H C H C H H H C O O C C C C H C H C H H H
charge: -0.210830 0.268211 -0.232948 0.124604 0.120274 0.116645 0.117832 0.116297 0.959694 -0.209031 -0.218192 -0.203030 -0.206807 -0.212618 -0.140798 0.061209 -0.202655 -0.198516 -0.116734 0.120500 -0.117269 0.122419 -0.111871 0.122114 0.122410 0.123604 0.217035 -0.288077 -0.270407 0.231173 -0.119079 -0.156995 -0.116957 0.117338 -0.101404 0.123474 -0.117437 0.122377 0.122236 0.122209
chargesum: -0.00000
title: Mulliken charges with hydrogens summed into heavy atoms:
elementType: C C C C S F F F F F Cl C C C C C C C O O C C C C C C
charge: 0.026088 0.268211 0.001181 0.124604 0.959694 -0.209031 -0.218192 -0.203030 -0.206807 -0.212618 -0.140798 0.061209 -0.082154 -0.076098 0.005380 0.005141 0.011734 0.217035 -0.288077 -0.270407 0.231173 -0.001741 -0.033521 0.005420 0.020831 0.004773
chargesum: 0.00000
1716.lowfreq: -7.5023 -3.5197 -0.0014 -0.0004 0.0015 2.7757 15.1925 16.4571 30.3873
frequency: 14.8449 16.1223 30.3860 40.0163 42.6285 54.7704 89.4446 102.1019 107.2592 127.2880 150.1974 172.3197 189.1507 210.5790 224.0101 265.8094 282.9800 302.5785 349.3174 353.4344 384.5437 408.9550 416.8097 418.7424 426.8551 433.2394 452.7673 466.3332 481.9339 514.9348 530.0404 537.5742 570.6382 577.8235 596.2877 602.1650 608.8239 634.5910 638.2348 638.5923 668.0262 696.9813 702.9406 718.9166 725.0201 763.4768 784.8151 804.2694 844.5258 851.4071 862.5243 874.9683 875.1533 876.4068 892.0524 897.4725 904.0114 957.8830 965.1182 1006.5273 1008.5016 1014.4116 1029.5264 1030.5541 1032.6358 1034.7769 1056.3994 1058.0923 1064.0464 1104.8229 1108.2534 1119.2809 1129.3523 1141.5866 1157.8106 1188.7472 1191.8422 1195.5467 1218.6789 1222.2601 1251.6779 1268.7671 1283.0441 1320.2471 1331.7699 1333.1900 1353.0660 1356.5114 1369.0379 1471.7759 1489.6876 1500.1854 1506.6953 1544.2733 1552.1590 1661.3486 1673.5946 1676.8916 1683.3263 1862.0077 3133.9309 3136.9979 3192.9926 3196.0487 3200.9373 3202.2140 3202.8630 3205.6103 3210.6534 3215.5700 3220.0653 3225.6707 3227.5869 3231.7983
redmass: 4.9403 4.7202 3.9427 8.0294 10.3046 7.6605 8.8412 7.3753 8.2273 9.2878 10.0785 7.8638 9.1131 7.6561 11.6426 5.8728 6.0728 7.9413 4.5871 5.5939 3.2315 4.7331 2.9479 13.3189 2.9643 5.1133 5.3490 6.2487 17.9581 3.6635 4.0366 3.8650 14.5681 15.8811 15.5487 6.7989 12.3998 6.4839 6.3226 3.6701 14.6709 4.0452 7.2622 1.9148 1.6185 2.9236 2.1940 2.2379 7.6755 5.1814 1.2844 4.7809 1.2856 8.8193 2.3914 4.6777 3.2044 1.4532 1.8956 3.1466 1.3657 1.3800 1.4205 5.9491 4.7289 1.3265 3.3607 2.5630 2.3092 3.0887 1.4641 1.7150 1.2385 3.4031 3.4139 1.1570 1.1555 1.1779 1.1429 2.1057 3.9150 1.3196 2.1712 3.2055 3.1325 4.3717 2.3237 1.6716 1.4207 1.0824 1.1132 2.2897 2.3126 2.3744 2.3515 5.8889 5.9854 6.5349 5.7540 12.9605 1.0583 1.0604 1.0865 1.0885 1.0861 1.1097 1.1090 1.0912 1.0897 1.0950 1.0931 1.0989 1.0961 1.0985
irintensity: 0.1993 0.2439 0.1007 0.3156 0.1368 0.1912 0.3618 1.9794 0.4606 1.5540 1.2588 1.8963 0.3143 0.0759 0.0114 0.5797 5.1009 1.3935 0.6440 0.0641 4.8150 0.4512 0.1117 2.3783 0.2698 4.2608 1.5379 25.3741 0.0735 8.1573 9.4713 19.2943 8.4606 4.2686 5.8613 8.8748 14.3464 0.8665 0.8842 45.7378 22.0994 1.3724 3.8368 28.0483 45.5690 22.0393 42.6918 13.5681 201.2101 151.0659 7.3581 209.0435 8.1542 263.5000 108.5039 87.4374 71.2762 1.0251 15.6632 2.2492 0.0921 0.0315 1.3017 0.8615 3.9292 0.0114 3.3026 5.7571 8.5995 8.1623 7.6009 5.4424 10.0616 64.2417 7.1398 0.0700 0.0187 2.0967 1.0715 128.1588 330.5707 1.7297 38.0156 178.4747 3.0470 0.3303 129.9829 7.6686 1.4935 16.5126 5.6429 7.2514 2.9285 82.0636 6.3261 1.4042 33.0088 9.2697 1.3459 180.0649 1.8005 7.2162 4.7585 0.4451 0.0368 0.2670 0.4937 5.3386 5.7399 15.1879 11.1682 10.9680 4.2618 3.6059
temp: 298.150 k
press: 1.00000 atm
elementType: 6 6 6 6 1 1 1 1 16 9 9 9 9 9 17 6 6 6 6 1 6 1 6 1 1 1 6 8 8 6 6 6 6 1 6 1 6 1 1 1
symmnumber: 1
zpe: 756859.0 jmol-1
zpe.correction: 0.288272 hartree
zpe.thermalcorrener: 0.310648 hartree
zpe.thermalcorrenthalpy: 0.311592 hartree
zpe.thermalcorrgfe: 0.233264 hartree
zpe.sumelectzpe: -2164.076193 hartree
zpe.sumelectthermal: -2164.053817 hartree
zpe.sumelectthermalent: -2164.052873 hartree
zpe.sumelectthermalfe: -2164.131202 hartree
dipole: -1.5558 -1.8933 -0.7953
dipole: 2.5764
quadrupole: -157.1907 -146.3036 -165.1339
quadrupole: -12.1404 -7.2530 4.0790
quadrupole: -0.9813 9.9058 -8.9245 -12.1404 -7.2530 4.0790
hfenergy: -2164.3644652 hartree
pointgroup: C01 [X(C17H14Cl1F5O2S1)]
dipole: -0.6120997 -0.7448988 -0.3128818 debye
polarizability: 198.3395991|-36.1874597|278.6826452|0.0554621|26.347131|208.1547032 unknown
InChI: InChI=1/C17H14ClF5O2S/c18-16(13-7-3-1-4-8-13)11-17(12-16,26(19,20,21,22)23)15(24)25-14-9-5-2-6-10-14/h1-10H,11-12H2
charge 0 multiplicity 1
40 atoms
C  1.48722822 0.57064062 0.21524071
C  0.25417884 -0.24455128 -0.23400423
C  -0.39534646 0.0261283 1.13970477
C  0.64576408 1.14094235 1.37253926
H  1.88890376 1.30838227 -0.47117432
H  2.27446531 -0.09235339 0.55948756
H  -1.43593726 0.32970594 1.15826325
H  -0.24356489 -0.81951713 1.80316329
S  1.4620517 1.14802439 3.04761946
F  0.09622307 0.75501528 3.76814412
F  1.83465455 -0.399342 2.89723688
F  2.86208158 1.55616485 2.4137462
F  1.14858086 2.68628219 3.32095616
F  2.16522265 1.10589659 4.46255849
Cl -0.65305637 0.64116289 -1.53595376
C  0.45180817 -1.66500851 -0.67033082
C  -0.4959701 -2.6333403 -0.36345813
C  1.57718668 -2.02367583 -1.40194842
C  -0.31855876 -3.94365141 -0.77657403
H  -1.38096115 -2.36248729 0.19859026
C  1.75584681 -3.33343468 -1.81593135
H  2.31722837 -1.27449099 -1.6538743
C  0.80865896 -4.29653599 -1.50279622
H  -1.06135425 -4.69038764 -0.52999799
H  2.63682517 -3.60251665 -2.38302811
H  0.9491433 -5.32009481 -1.82322443
C  0.14387904 2.55142681 1.05061775
O  0.77138087 3.35376726 0.43308191
O  -1.08710094 2.73817656 1.54547095
C  -1.69268995 3.97730054 1.34229619
C  -2.24558517 4.27284747 0.11174435
C  -1.77195927 4.84758616 2.41031443
C  -2.89785338 5.48453541 -0.04909104
H  -2.15680525 3.56491363 -0.70066463
C  -2.42951022 6.05607282 2.23701303
H  -1.32450875 4.57589583 3.35607836
C  -2.99142267 6.37552107 1.01039976
H  -3.33391727 5.73243491 -1.00728259
H  -2.50052109 6.74872054 3.06461102
H  -3.5025978 7.31946125 0.87910719
