program: Gaussian 16
title: Title Card Required
version: ES64L-G16RevC.01
method: RmPW1PW91
basis: 6-31+G(d,p)
operation: Freq
keyword: #N
keyword: Geom=AllCheck
keyword: Guess=TCheck
keyword: SCRF=Check
keyword: GenChk
keyword: RmPW1PW91/6-31+G(d,p)
keyword: Freq
converged: YES YES NO YES
title: Mulliken charges:
elementType: C C C C C C H H H H H H H H C H H H C C H C H C H H C H H C C H H H C H H C H H H C H C H H C H H C H H H
charge: 0.430497 -0.362034 -0.907704 -0.072337 -0.511339 -0.320548 0.190115 0.158166 0.183419 0.182173 0.170709 0.181266 0.183092 0.176344 -0.623844 0.170116 0.184625 0.161720 0.540344 -0.580436 0.171893 0.186186 0.149974 -0.063823 0.191530 0.158700 -0.604496 0.176950 0.202107 0.358551 -0.396259 0.172478 0.177276 0.204227 -0.570447 0.168260 0.199462 -0.713341 0.211998 0.177856 0.157036 0.630683 0.172827 -0.531377 0.218177 0.177160 -0.460529 0.227809 0.206582 -0.587390 0.231336 0.217881 0.246379
chargesum: 1.00000
title: Mulliken charges with hydrogens summed into heavy atoms:
elementType: C C C C C C C C C C C C C C C C C C C C
charge: 0.588663 -0.362034 -0.541245 0.111082 -0.158458 0.043811 -0.107383 0.540344 -0.408543 0.336160 0.286407 -0.225439 0.358551 0.157723 -0.029896 -0.166451 0.630683 -0.136040 -0.026138 0.108206
1716.lowfreq: -5.2291 -3.4599 -0.0004 0.0002 0.0005 6.1786 43.0675 53.4541 93.7365
frequency: 43.0659 53.4469 93.7362 104.5315 128.6211 151.6530 155.5238 171.8540 193.6027 202.7505 215.7871 224.6849 261.6646 265.9247 270.0276 277.2042 290.9332 298.6155 309.1443 327.1184 332.4371 355.0439 364.6613 370.8490 406.7666 415.6620 444.6864 463.8846 495.1421 500.3470 513.1449 551.2951 557.1706 568.8866 576.6154 615.7481 633.9466 707.9408 740.8196 770.3641 800.7956 820.7633 834.4895 847.0850 869.8036 877.6586 893.6986 916.8869 924.7875 938.5935 944.0384 949.3799 952.5516 966.8292 976.6701 983.4262 997.9821 998.8820 1010.1315 1026.6208 1030.9139 1040.9432 1052.0680 1059.3310 1081.2206 1084.3133 1104.4836 1121.0695 1136.1402 1152.4301 1157.3821 1169.3667 1171.7489 1195.2444 1202.5719 1217.9976 1229.8909 1233.7429 1239.1352 1248.3509 1255.9440 1270.3027 1274.3327 1289.6021 1308.5734 1320.2213 1331.2168 1334.3822 1344.3289 1362.8843 1364.4144 1368.0849 1375.6859 1378.1909 1388.5597 1393.1718 1411.5716 1414.6753 1424.8797 1431.4200 1434.3934 1445.7884 1468.7045 1478.0822 1485.0426 1487.9588 1490.4182 1492.2752 1497.5191 1498.7371 1499.5931 1502.0826 1505.5223 1508.0784 1510.1836 1514.3801 1519.8154 1521.5606 1522.5151 1716.8340 3031.6910 3032.2888 3057.6250 3060.8377 3064.3248 3064.6993 3069.1011 3070.9491 3071.6296 3073.9573 3076.2848 3088.6156 3096.2990 3103.4732 3107.2890 3110.4202 3115.3337 3134.1234 3141.0813 3141.4716 3144.3232 3147.7794 3149.4406 3151.7602 3153.2381 3153.6228 3159.1566 3160.5520 3162.5546 3169.7224 3177.5641 3203.8131 3220.2978
redmass: 3.0066 3.1684 2.6650 2.2531 1.8354 1.6798 2.3899 2.3359 1.3330 2.7986 2.0704 2.8728 2.2852 1.3988 1.2950 1.8428 2.2519 2.4826 2.5826 2.2402 1.1372 2.5207 2.2384 2.5168 2.6617 2.4033 2.5894 2.7489 2.2918 2.6854 2.6278 2.4522 2.0619 2.8450 2.4977 2.5699 2.2638 2.7106 2.8223 2.5491 3.6761 2.5370 1.8693 1.7491 2.0084 2.1894 2.1745 1.9318 1.7900 2.0057 1.6381 1.8433 1.5660 1.4056 1.8028 1.8624 1.8063 1.9109 1.4499 1.9909 1.9000 1.6472 1.9098 1.6684 2.0433 2.2852 1.8277 2.2121 1.8223 1.9875 1.5774 1.9799 2.0251 1.5212 1.6673 1.8569 1.6374 1.4620 1.5378 1.5472 1.6540 1.2257 1.5724 1.5364 1.4104 1.3339 1.5016 1.3354 1.3561 1.3117 1.3437 1.3689 1.3954 1.4068 1.7283 1.5103 1.2355 1.2853 1.2951 1.4173 1.2339 1.1071 1.2326 1.0804 1.1125 1.0743 1.0606 1.0676 1.1147 1.0890 1.1031 1.0971 1.2320 1.0550 1.1113 1.1827 1.0662 1.1459 1.0771 6.1520 1.0511 1.0826 1.0408 1.0367 1.0654 1.0687 1.0398 1.0609 1.0708 1.0457 1.0688 1.0616 1.0638 1.0855 1.0976 1.0693 1.0986 1.0983 1.0969 1.1029 1.1045 1.1001 1.1018 1.1021 1.1009 1.0919 1.1013 1.0993 1.0834 1.1003 1.0982 1.0939 1.0999
irintensity: 0.1793 0.1349 0.8202 1.7209 0.3557 0.2768 1.1657 0.4076 0.7097 0.2495 0.4322 1.2293 0.0467 0.3026 0.0063 0.7212 1.0583 0.2136 0.3854 1.5854 0.1897 0.7709 0.3541 1.3274 0.4398 5.9670 3.2614 0.8731 6.6453 9.7081 0.4830 0.9221 3.9554 5.7917 13.0612 1.1254 17.7101 2.9871 6.2470 11.6038 64.2759 3.9090 35.2167 0.9538 12.8604 9.0707 5.1356 10.8241 14.9708 3.9536 3.9502 1.3122 4.0814 7.0461 64.1341 3.4941 1.3686 5.3738 2.4201 4.2480 4.7154 0.8149 1.3093 3.2007 1.1856 0.3997 17.6707 13.0873 22.3926 43.4489 4.2301 29.5928 120.4890 11.0050 12.4480 13.3724 9.2845 26.4288 3.5641 6.0088 15.7993 10.4673 10.1446 2.7759 0.3288 2.3600 1.6270 10.2538 34.8424 61.0673 4.6915 15.0879 0.9812 5.1800 64.3802 5.1490 1.4317 25.0202 5.9808 20.5542 27.4753 9.1248 18.6731 13.4089 11.0381 3.8123 0.5717 5.3161 0.0376 11.4042 9.3127 8.0970 20.1220 10.7825 3.2807 23.8902 1.8063 44.0701 20.7909 63.3134 25.0358 16.0569 7.1357 13.3842 19.6329 9.9598 19.3371 0.9698 4.4020 19.7847 10.5928 23.0405 7.3349 2.2406 18.4467 15.4849 4.3215 20.8422 21.7391 7.6983 20.4983 17.9452 7.3700 23.4860 18.9053 4.5353 7.9792 10.1561 7.8417 2.5800 24.9956 2.5660 5.3206
temp: 298.150 k
press: 1.00000 atm
elementType: 6 6 6 6 6 6 1 1 1 1 1 1 1 1 6 1 1 1 6 6 1 6 1 6 1 1 6 1 1 6 6 1 1 1 6 1 1 6 1 1 1 6 1 6 1 1 6 1 1 6 1 1 1
symmnumber: 1
zpe: 1291320.7 jmol-1
zpe.correction: 0.491838 hartree
zpe.thermalcorrener: 0.512299 hartree
zpe.thermalcorrenthalpy: 0.513244 hartree
zpe.thermalcorrgfe: 0.445930 hartree
zpe.sumelectzpe: -781.107702 hartree
zpe.sumelectthermal: -781.087241 hartree
zpe.sumelectthermalent: -781.086297 hartree
zpe.sumelectthermalfe: -781.153611 hartree
dipole: -2.7853 -4.8678 1.6215
dipole: 5.8381
quadrupole: -100.1988 -94.4340 -113.3858
quadrupole: 7.6365 -1.6710 -4.9846
quadrupole: 2.4741 8.2388 -10.7129 7.6365 -1.6710 -4.9846
hfenergy: -781.5995405 hartree
pointgroup: C01[X(C20H33)]
dipole: -1.1066639 -1.9167834 0.6194819 debye
polarizability: 240.132352|8.0991447|249.6435564|5.89866|-9.1672|183.0841771 unknown
InChI: InChI=1/C20H33/c1-14-7-6-8-15(2)17-13-20(12-11-14)16(3)9-10-18(20)19(17,4)5/h7,16-18H,6,8-13H2,1-5H3
charge 1 multiplicity 1
53 atoms
C  1.48265874 2.20429002 0.71430452
C  0.77373685 1.044185 -0.05738089
C  -0.06057873 0.14203578 0.86841764
C  1.94061024 0.07316054 -0.48403065
C  3.22286875 0.66453613 0.11910588
C  2.91801449 2.15988427 0.17398524
H  0.45195599 -0.00767549 1.8221599
H  1.54029771 1.89645334 1.76789849
H  2.04048275 0.11862037 -1.57439702
H  4.11289726 0.42165144 -0.46678662
H  3.39555783 0.30157165 1.1368075
H  2.95728358 2.60067633 -0.83038724
H  3.61733929 2.72086382 0.79975273
H  -1.05803578 0.51534578 1.08759473
C  0.84894178 3.58859246 0.68741967
H  0.75937532 3.98700115 -0.3268025
H  1.47298708 4.28686702 1.25142292
H  -0.14150437 3.60101203 1.15052273
C  1.53597465 -1.40390484 -0.12279758
C  -0.02807112 -1.1881017 0.06162171
H  -0.37275465 -0.97171733 -0.94764187
C  -2.53526918 -0.22665331 -1.18677379
H  -1.99941605 -0.41200699 -2.11776256
C  -0.00453214 1.50736533 -1.32222811
H  0.58930951 2.29336739 -1.801355
H  -0.00278107 0.69180008 -2.05375028
C  -1.45872733 2.02009325 -1.2031485
H  -1.49676254 2.92119954 -0.587315
H  -1.76969442 2.33667889 -2.20621835
C  -2.45078911 1.00849915 -0.65461479
C  2.22161213 -1.96412551 1.12140948
H  1.8819478 -2.98199168 1.33282274
H  2.07608819 -1.35771704 2.01815896
H  3.29898599 -2.02198708 0.94848261
C  1.79075966 -2.35370226 -1.29417451
H  1.46876778 -3.37550027 -1.07019421
H  2.86122914 -2.39276875 -1.51452891
C  -3.27972901 1.48737488 0.50168298
H  -3.92200323 2.3039927 0.15188121
H  -2.66491086 1.91489418 1.30157934
H  -3.93490825 0.72803905 0.92925176
C  -0.96201926 -2.14877402 0.61181335
H  1.28235496 -2.02216175 -2.20426527
C  -3.13727441 -1.43331054 -0.5592066
H  -3.84929707 -1.93799599 -1.21900539
H  -3.6580426 -1.2055656 0.37161342
C  -2.06140107 -2.58826009 -0.25589417
H  -1.64468753 -2.86245674 -1.23234168
H  -2.60473406 -3.43566762 0.16697037
C  -0.92555154 -2.6171459 2.00490838
H  -1.927749 -2.59451795 2.44837445
H  -0.21036537 -2.09851805 2.63807108
H  -0.65925074 -3.68598606 1.9765297
