program: Gaussian 16
title: Title Card Required
version: ES64L-G16RevC.01
method: RmPW1PW91
basis: 6-31+G(d,p)
operation: Freq
keyword: #N
keyword: Geom=AllCheck
keyword: Guess=TCheck
keyword: SCRF=Check
keyword: GenChk
keyword: RmPW1PW91/6-31+G(d,p)
keyword: Freq
converged: YES YES NO YES
title: Mulliken charges:
elementType: C C C C C C H H H H H H H H C H H H C C H C H C H H C H H C C H H H C H H C H H H C H C H H C H H C H H H
charge: -0.159391 -0.031519 -0.021268 -0.117018 -0.628123 -0.057587 0.206026 0.159132 0.133765 0.195580 0.144592 0.163131 0.172785 0.169255 -0.478407 0.192532 0.142465 0.172181 0.529193 -0.240906 0.178340 -0.221013 0.163511 -0.581475 0.183506 0.196335 -0.504718 0.185898 0.180535 0.545147 -0.669737 0.151244 0.196647 0.164397 -0.611309 0.190386 0.166552 -0.794905 0.150199 0.218523 0.175809 0.544286 0.162118 -0.403413 0.218637 0.187441 -0.437582 0.213404 0.213299 -0.652810 0.190201 0.238266 0.215866
chargesum: 1.00000
title: Mulliken charges with hydrogens summed into heavy atoms:
elementType: C C C C C C C C C C C C C C C C C C C C
charge: -0.000258 0.174507 0.147986 0.016747 -0.287951 0.278328 0.028771 0.529193 -0.062566 -0.057502 -0.201633 -0.138285 0.545147 -0.157449 -0.092253 -0.250375 0.544286 0.002664 -0.010879 -0.008477
1716.lowfreq: -181.0410 -4.4300 -3.0754 -0.0004 0.0002 0.0005 4.0442 15.9109 27.2450
frequency: -181.0410 15.8383 27.2266 33.0079 50.9135 69.6225 84.4995 111.5166 124.1859 134.1926 140.9775 146.4376 180.5920 189.2397 200.3489 206.9129 220.1364 241.0773 263.5835 265.3097 283.8637 287.1257 298.0047 307.9147 331.5640 372.1465 397.0850 405.0783 423.6853 441.8896 452.5344 480.1023 485.3700 511.8136 531.3953 556.9660 574.1123 597.8982 647.9407 727.3111 772.9900 789.4728 796.0363 816.5072 835.2299 841.3542 860.0030 888.0140 901.6316 906.7312 929.3495 936.9809 953.7641 961.8922 963.9259 967.9918 992.3451 1006.9969 1011.7887 1016.2016 1017.2987 1043.0640 1052.4173 1059.7177 1062.7276 1076.9831 1098.8197 1105.7614 1113.9728 1121.2373 1148.0344 1152.6122 1156.7787 1180.1136 1209.6884 1241.5287 1246.7175 1258.9707 1260.7793 1277.5701 1283.7355 1289.6238 1302.8332 1304.8268 1326.6508 1338.0839 1345.9205 1351.7743 1353.5285 1378.6132 1381.0053 1387.6508 1396.6289 1398.9409 1400.4895 1417.7994 1423.9143 1428.6568 1429.1206 1432.9345 1446.5260 1463.4794 1474.6472 1477.4859 1483.7352 1485.2651 1488.7106 1491.3954 1495.1461 1496.5888 1501.9036 1503.6423 1507.2369 1510.0160 1511.9724 1518.9557 1526.8370 1626.4868 1708.6176 1744.3138 3002.5516 3028.1295 3048.5152 3049.4915 3052.2507 3057.3375 3062.2462 3066.0529 3066.9007 3078.2264 3103.7244 3105.8256 3107.2473 3110.4036 3113.4876 3114.5261 3115.4855 3120.9583 3129.9920 3131.8290 3137.6512 3145.9425 3156.8037 3157.0684 3160.8054 3164.8186 3171.4101 3172.5570 3175.5037 3181.5725 3191.3733 3198.4466 3208.4833
redmass: 1.8167 3.2809 3.3855 3.2505 2.9288 3.1186 3.4600 2.6908 2.0909 1.3428 2.2089 1.5149 1.2575 1.2961 1.5649 1.6349 1.9669 1.6095 2.5041 3.3313 2.1497 2.6888 2.7246 2.5015 2.7536 2.3217 2.3122 2.8432 2.9572 2.1874 2.4933 2.1131 2.5778 2.8596 2.7379 2.7077 2.6390 2.3741 2.7324 2.2015 2.0939 2.9966 2.0892 2.3408 2.3509 1.4582 2.3893 1.6855 1.7730 1.7953 2.2026 1.7320 1.6115 1.7298 1.4267 1.6103 1.6014 1.4234 1.2674 1.7104 1.9420 1.5660 1.6865 1.8809 2.1966 2.2390 1.6991 1.6943 2.0432 1.7877 2.0277 2.0077 1.7587 1.3579 1.7583 1.6181 1.5939 1.1224 1.7928 1.1698 1.2555 1.1503 1.2543 1.1936 1.3444 1.3504 1.3138 1.3576 1.3524 1.2959 1.2926 1.3550 1.2896 1.3771 1.4136 1.4767 1.4475 1.4036 1.3036 1.3369 1.6436 1.0849 1.0569 1.0779 1.1235 1.0748 1.0743 1.0567 1.0711 1.0434 1.0710 1.0842 1.1675 1.0880 1.3108 1.4420 1.1247 3.7570 6.2508 6.6048 1.0814 1.0836 1.0420 1.0635 1.0459 1.0409 1.0582 1.0437 1.0408 1.0624 1.0601 1.0968 1.0607 1.0985 1.0816 1.0904 1.0896 1.0900 1.1000 1.0964 1.0996 1.0890 1.1004 1.1007 1.1003 1.1041 1.0982 1.0982 1.1015 1.1025 1.0948 1.0973 1.0889
irintensity: 1.0489 1.5877 1.3580 3.0574 2.0641 1.3533 3.5950 0.6781 0.6992 6.3174 0.9665 5.0957 3.9024 0.9722 0.1620 0.1919 0.2109 1.7789 10.8744 3.7527 3.3654 4.9691 0.6715 2.5321 1.6713 1.3559 0.5709 1.5823 2.6984 1.1156 7.5104 0.2843 10.6385 6.6176 0.7900 7.3190 5.9900 5.1344 18.8525 3.4221 4.9158 19.0138 8.0837 15.4484 14.1039 20.9728 1.7619 9.7300 9.2633 14.4947 6.6567 10.6863 10.5511 19.8049 2.6090 1.0728 14.3744 3.1092 12.5197 3.5557 0.7024 6.9219 0.7229 24.4597 10.3166 38.2267 2.1269 13.6643 7.0328 20.4937 12.4064 9.4971 44.9099 21.6953 1.9395 1.7663 14.6676 7.8383 3.2604 3.9755 6.3528 8.0820 7.8861 4.8801 37.6073 21.4948 3.4794 20.8595 5.5517 2.3023 21.3717 11.6220 0.3982 18.2152 18.1065 77.3702 13.4038 5.3732 6.1224 36.8749 75.5428 10.5530 3.4412 4.4944 6.7945 10.9444 11.3168 10.5647 4.5016 23.0692 18.1243 5.0848 28.0461 11.4191 3.4842 0.6972 9.2340 460.0479 51.7357 48.8511 258.8585 12.5721 15.7242 17.7755 9.0480 31.6365 17.7202 25.7692 8.0978 11.8748 1.8291 11.8546 6.0597 8.5846 5.5574 20.5857 18.4335 2.8626 3.5548 3.9825 33.2267 14.0651 16.6665 26.7195 4.9711 4.7517 7.0761 19.9686 3.4461 15.6343 0.2855 5.2834 0.9439
temp: 298.150 k
press: 1.00000 atm
elementType: 6 6 6 6 6 6 1 1 1 1 1 1 1 1 6 1 1 1 6 6 1 6 1 6 1 1 6 1 1 6 6 1 1 1 6 1 1 6 1 1 1 6 1 6 1 1 6 1 1 6 1 1 1
symmnumber: 1
zpe: 1277472.5 jmol-1
zpe.correction: 0.486564 hartree
zpe.thermalcorrener: 0.509388 hartree
zpe.thermalcorrenthalpy: 0.510333 hartree
zpe.thermalcorrgfe: 0.433989 hartree
zpe.sumelectzpe: -781.077423 hartree
zpe.sumelectthermal: -781.054599 hartree
zpe.sumelectthermalent: -781.053654 hartree
zpe.sumelectthermalfe: -781.129998 hartree
dipole: 6.2232 -1.1045 -2.2515
dipole: 6.7095
quadrupole: -83.2161 -105.6218 -109.8883
quadrupole: -7.2658 -7.4584 2.1490
quadrupole: 16.3593 -6.0464 -10.3129 -7.2658 -7.4584 2.1490
hfenergy: -781.5639869 hartree
pointgroup: C01 [X(C20H33)]
dipole: 2.4201069 -0.4263619 -0.9122247 debye
polarizability: 285.0612349|-18.5317027|240.1842271|-11.2303268|11.5294596|211.0560563 unknown
InChI: InChI=1/C20H33/c1-16(2)8-6-11-19(5)20-14-12-17(3)9-7-10-18(4)13-15-20/h8-9,13,15,19-20H,6-7,10-12,14H2,1-5H3
charge 1 multiplicity 1
53 atoms
C  -1.29477584 1.87424032 -0.59923201
C  -0.51387922 0.69991211 0.05924447
C  0.65004105 0.35454361 -0.78755143
C  -3.50540639 -0.43139975 0.36890033
C  -3.67663634 0.81081553 -0.45784435
C  -2.74526824 1.97611092 -0.09406907
H  -1.16318177 -0.18727013 0.00389985
H  -1.36263058 1.63505696 -1.67084783
H  -3.46852166 -0.25500255 1.4454439
H  -4.70535155 1.1668889 -0.31337391
H  -3.58916101 0.59559709 -1.52748894
H  -2.75660037 2.13389322 0.99177619
H  -3.16415377 2.89068781 -0.52673135
H  1.09617506 1.14894768 -1.38379972
C  -0.58289164 3.22104469 -0.4727453
H  -1.1191078 3.98493661 -1.04049033
H  0.43954832 3.19925184 -0.86376281
H  -0.53501028 3.56602907 0.56417436
C  -3.48478574 -1.71312627 -0.0379439
C  1.20087206 -0.90064716 -0.85985203
H  0.78967587 -1.66945719 -0.21148644
C  2.82897846 -0.70899397 1.51618306
H  2.32230266 -1.45770563 2.12400004
C  -0.28607562 0.90960336 1.61262365
H  -0.74813121 1.86726038 1.85507222
H  -0.91503669 0.16054175 2.09528465
C  1.10498344 0.86639858 2.3390599
H  1.25312508 1.83816409 2.82096261
H  1.02196693 0.1373992 3.1487651
C  2.33519992 0.54674434 1.53557565
C  -3.58783901 -2.15790049 -1.46913883
H  -3.56100206 -1.33655253 -2.1855386
H  -4.52509269 -2.70292112 -1.62808289
H  -2.78209376 -2.85807699 -1.71753497
C  -3.39792181 -2.83475775 0.9597061
H  -4.27895596 -3.48238872 0.89023088
H  -3.33160272 -2.46859248 1.9864015
C  2.97487569 1.71844231 0.84392201
H  3.66064749 1.44540225 0.04078679
H  3.55009984 2.29416478 1.57830227
H  2.22669431 2.40735104 0.44297813
C  2.47823157 -1.11363511 -1.39686068
H  -2.53067638 -3.47633441 0.76259888
C  3.90011676 -1.22408431 0.62674729
H  4.52113546 -1.95961516 1.14498786
H  4.56279208 -0.43839224 0.26103787
C  3.33677278 -2.03614864 -0.64507357
H  2.77566148 -2.89066812 -0.25971952
H  4.19780683 -2.38524504 -1.2176005
C  3.05536432 -0.35363426 -2.52868936
H  2.44153626 0.47737886 -2.87290831
H  3.15769838 -1.05472191 -3.36879713
H  4.07036399 -0.01048236 -2.30650377
