program: Gaussian 16
title: Title Card Required
version: ES64L-G16RevC.01
method: RmPW1PW91
basis: 6-31+G(d,p)
operation: Freq
keyword: #N
keyword: Geom=AllCheck
keyword: Guess=TCheck
keyword: SCRF=Check
keyword: GenChk
keyword: RmPW1PW91/6-31+G(d,p)
keyword: Freq
converged: YES YES YES YES
title: Mulliken charges:
elementType: C C C C C C H H H H H H H H C H H H C C H C H C H H C H H C C H H H C H H C H H H C H C H H C H H C H H H
charge: 0.024738 0.211476 -0.288246 0.002512 -0.483288 -0.283214 0.177619 0.157243 0.123059 0.194575 0.151919 0.165259 0.181196 0.178781 -0.555621 0.190346 0.167801 0.184783 0.524061 -0.404200 0.181710 0.016735 0.152059 -0.331082 0.184370 0.195147 -0.641402 0.196507 0.167290 0.519086 -0.663252 0.157225 0.198761 0.160805 -0.677871 0.197041 0.157977 -0.746680 0.173183 0.200595 0.169921 0.443813 0.150599 -0.534151 0.212957 0.173649 -0.404190 0.212766 0.206112 -0.688420 0.183568 0.232390 0.221982
chargesum: 1.00000
title: Mulliken charges with hydrogens summed into heavy atoms:
elementType: C C C C C C C C C C C C C C C C C C C C
charge: 0.181981 0.389095 -0.109465 0.125571 -0.136794 0.063241 -0.012690 0.524061 -0.222491 0.168794 0.048435 -0.277604 0.519086 -0.146462 -0.172255 -0.202980 0.443813 -0.147545 0.014689 -0.050479
1716.lowfreq: -49.2366 -4.6535 -0.0007 -0.0006 -0.0005 2.6596 4.9751 20.9405 46.0622
frequency: -49.2342 20.8103 46.0599 57.0322 67.6046 84.2940 97.3335 109.6866 125.7965 128.6398 149.0084 154.8291 171.6408 190.9234 197.3464 220.3037 239.9578 268.5967 289.8069 294.9812 296.6451 312.8061 329.4763 334.7820 338.6898 383.3777 408.1576 411.3252 431.0677 446.1708 454.4352 460.1133 482.9282 507.1155 525.1266 543.9741 570.1643 578.3144 609.8319 770.1256 780.0825 801.6980 829.0752 834.8451 838.2818 846.2841 870.7655 892.6059 901.3950 903.6526 931.9712 943.2300 951.7072 962.8749 970.7281 988.4039 993.1482 1003.8846 1006.3651 1024.4254 1028.2768 1042.3188 1047.3486 1052.8099 1057.1955 1077.0238 1093.8930 1097.6300 1123.0300 1130.1630 1142.3950 1155.0423 1159.9998 1175.4855 1188.3438 1202.5601 1239.8771 1247.1436 1260.1573 1271.1917 1279.1918 1284.8285 1295.0910 1308.2499 1320.3310 1330.8596 1346.9161 1354.4710 1355.3692 1371.4767 1377.9286 1388.3493 1396.2913 1399.1201 1401.7458 1419.5326 1419.8699 1428.5735 1429.2201 1431.7476 1451.5565 1464.5786 1472.1066 1473.3787 1477.4007 1482.4008 1488.6190 1489.2926 1491.1408 1495.7642 1496.7254 1500.9862 1505.5193 1510.4836 1514.1783 1517.0247 1522.2225 1626.6875 1727.2600 1729.5645 3030.3328 3035.7452 3053.6003 3054.5053 3056.5569 3058.3188 3059.2157 3061.6609 3074.5188 3085.7672 3096.0767 3097.5959 3101.9398 3102.7049 3108.3751 3115.1686 3115.3227 3117.5754 3121.5732 3122.7477 3143.9019 3151.8786 3153.3442 3156.6964 3157.7441 3163.7504 3166.9488 3173.5720 3177.7144 3178.5537 3185.9789 3198.5281 3223.4203
redmass: 3.4705 3.3493 3.0959 3.3744 3.0798 3.4469 2.4973 1.4713 2.2201 1.2419 2.3138 1.7450 1.4633 1.6944 1.7265 1.8884 2.3365 3.1173 2.2681 2.4996 1.8903 1.7114 2.1376 2.5407 2.2713 2.3487 2.1387 2.6275 2.5305 2.6293 2.6246 2.3489 2.0062 2.5246 2.6839 2.4328 2.4019 2.6561 2.3596 2.4058 2.0604 2.3473 2.2918 2.3608 2.0215 1.6878 1.7857 1.8679 1.6881 1.8757 1.8566 1.8489 1.5647 1.3704 1.7503 1.8352 1.5962 1.4801 1.2622 1.7499 2.0942 1.5694 2.0335 1.7966 2.0255 1.8825 1.7051 1.8153 2.0708 1.9186 2.0962 2.0667 1.5422 1.2318 1.3645 1.3647 1.4750 1.7386 1.6704 1.3436 1.2963 1.2031 1.3161 1.2366 1.4818 1.2971 1.3419 1.3089 1.3747 1.5051 1.2416 1.4293 1.2451 1.3019 1.3565 1.4659 1.3752 1.3351 1.3092 1.4243 1.5936 1.0701 1.0486 1.0751 1.0795 1.0982 1.0841 1.1058 1.0730 1.0523 1.0822 1.0955 1.1118 1.2044 1.0570 1.1573 1.5147 3.7329 6.5733 6.5211 1.0453 1.0833 1.0663 1.0561 1.0521 1.0420 1.0414 1.0648 1.0388 1.0805 1.0597 1.0690 1.0901 1.0613 1.0979 1.0987 1.0957 1.0962 1.0960 1.0937 1.0897 1.1027 1.1000 1.0995 1.1013 1.1025 1.1010 1.0994 1.0988 1.0979 1.0911 1.0992 1.0897
irintensity: 7.0940 0.3606 0.6626 0.3816 7.3812 0.1211 1.3242 1.0045 0.9443 4.3251 0.0566 0.5351 0.5411 1.9045 0.5098 6.7299 3.3785 2.4081 4.5953 0.7998 0.5216 1.3192 0.3438 3.5583 2.2468 4.2688 0.4423 8.5203 1.9977 1.9406 2.3006 3.9121 0.0324 14.1953 0.9325 1.6669 15.0281 5.7199 6.5949 4.3101 3.2119 2.9818 21.4385 22.8434 18.8836 10.4403 7.2820 22.5595 9.5313 20.8914 5.7913 32.8810 6.2302 0.3953 3.1603 16.9653 21.6663 3.6306 2.8424 7.3766 6.7184 4.8065 35.4422 1.1416 7.5519 21.3555 1.1510 3.3737 5.1540 23.9891 12.5752 7.6910 38.5113 42.2565 9.2410 12.0244 2.2749 7.2452 0.4448 11.9463 2.9214 14.6715 5.1435 1.0791 33.3063 3.3195 3.6816 33.9209 2.8401 3.3703 17.0032 3.0466 10.8957 4.2568 9.1150 72.4102 12.1547 25.4264 6.2103 13.4055 75.9260 15.9076 4.1644 8.0807 2.9293 0.8155 13.4569 24.9399 2.4771 22.1699 7.2044 8.2144 38.0599 8.4301 8.9034 10.0826 2.9227 438.7142 85.6874 69.2580 43.0767 7.6963 13.5999 16.0233 7.0843 31.9544 1.3610 21.3086 13.2367 5.0665 1.6194 14.4307 20.5213 10.8264 9.6424 5.4469 22.0263 1.1127 13.6723 10.0942 15.4386 1.6835 21.1602 2.2848 14.8827 24.1367 2.6532 6.3050 17.4291 15.7852 0.5548 6.4428 0.4769
temp: 298.150 k
press: 1.00000 atm
elementType: 6 6 6 6 6 6 1 1 1 1 1 1 1 1 6 1 1 1 6 6 1 6 1 6 1 1 6 1 1 6 6 1 1 1 6 1 1 6 1 1 1 6 1 6 1 1 6 1 1 6 1 1 1
symmnumber: 1
zpe: 1279130.8 jmol-1
zpe.correction: 0.487195 hartree
zpe.thermalcorrener: 0.509529 hartree
zpe.thermalcorrenthalpy: 0.510473 hartree
zpe.thermalcorrgfe: 0.436738 hartree
zpe.sumelectzpe: -781.089103 hartree
zpe.sumelectthermal: -781.066769 hartree
zpe.sumelectthermalent: -781.065825 hartree
zpe.sumelectthermalfe: -781.139560 hartree
dipole: -2.9850 -1.8953 1.5993
dipole: 3.8807
quadrupole: -96.3989 -97.4058 -113.6712
quadrupole: 8.2336 -1.5706 -2.3063
quadrupole: 6.0931 5.0861 -11.1792 8.2336 -1.5706 -2.3063
hfenergy: -781.5762985 hartree
pointgroup: C01 [X(C20H33)]
dipole: 1.2392743 0.6387421 0.6223268 debye
polarizability: 282.769206|14.6542488|266.9119271|2.4070394|3.9417876|187.6171709 unknown
InChI: InChI=1/C20H33/c1-16(2)8-6-11-19(5)20-14-12-17(3)9-7-10-18(4)13-15-20/h8-9,13,15,19-20H,6-7,10-12,14H2,1-5H3
charge 1 multiplicity 1
53 atoms
C  -1.92479065 -1.78220242 0.46694407
C  -0.52812899 -1.40169461 -0.1728424
C  0.02794431 -0.21215405 0.50585461
C  -2.73550828 0.98482815 -0.90845036
C  -3.66999937 -0.11276066 -0.50147245
C  -3.07613798 -1.52676713 -0.525977
H  -0.67188956 -1.1549927 -1.23030591
H  -2.08532609 -1.10632463 1.31822778
H  -2.26406724 0.84676418 -1.88333007
H  -4.52573397 -0.10202473 -1.18924686
H  -4.08588667 0.07625473 0.49232621
H  -2.75869779 -1.79052016 -1.54265134
H  -3.88859456 -2.21995212 -0.28506673
H  0.04995854 -0.24495106 1.59505595
C  -2.01844601 -3.20487315 1.02639309
H  -2.9675096 -3.31054702 1.55721957
H  -1.22510449 -3.44072041 1.73889299
H  -2.00708442 -3.96163426 0.23715467
C  -2.49690568 2.15105359 -0.27759984
C  0.65349335 0.82479617 -0.14571295
H  0.62239848 0.81713607 -1.23016977
C  3.10499252 -0.28034951 -1.12916716
H  2.75195579 -0.22770722 -2.15869899
C  0.51583576 -2.56863205 -0.13751569
H  0.76722451 -2.81202839 0.89865979
H  -0.0049556 -3.44242847 -0.53442444
C  1.80516448 -2.38427937 -0.96240643
H  2.29514525 -3.36622747 -0.98616709
H  1.55055232 -2.13872925 -1.99870845
C  2.75714636 -1.35855917 -0.40338807
C  -3.09586113 2.55376537 1.03953283
H  -3.63333535 1.74895855 1.54036167
H  -3.79823294 3.3827948 0.89777088
H  -2.32162598 2.9236138 1.72123133
C  -1.62239347 3.19520921 -0.90817659
H  -2.16853223 4.13708393 -1.02975214
H  -1.25699643 2.89119124 -1.89162811
C  3.22490852 -1.60394529 1.00570614
H  4.11991319 -1.03627131 1.26034306
H  3.46268779 -2.66319707 1.14301408
H  2.45651945 -1.36367565 1.75054129
C  1.58692277 1.66840327 0.46257337
H  -0.7584898 3.42691182 -0.26963837
C  3.74432149 0.95868168 -0.60820912
H  4.47538614 1.36678888 -1.31131918
H  4.25708365 0.79629245 0.34129071
C  2.68549443 2.13892961 -0.40625543
H  2.30519711 2.40579514 -1.39614519
H  3.21506242 2.9939332 0.01858593
C  1.65247613 1.96579111 1.91234115
H  0.87982543 1.48362612 2.50863053
H  1.55330183 3.05087545 2.04148836
H  2.64076026 1.71342878 2.31281407
