program: Gaussian 16
title: Title
version: ES64L-G16RevC.02
frameworkgroup: C1[X(C7H8B12I11)]
method: RB3LYP
basis: def2TZVPP
operation: Freq
keyword: #N
keyword: Geom=AllCheck
keyword: Guess=TCheck
keyword: SCRF=Check
keyword: GenChk
keyword: RB3LYP/def2TZVPP
keyword: Freq
converged: YES YES YES YES
title: Mulliken charges:
elementType: B B B B B B B B B B B B I I I I I I I I I I I H C C C C H C H C H H C H H H
charge: -0.084600 -0.280966 0.159472 0.091448 -0.077790 -0.074228 0.126381 -0.084592 -0.086034 -0.077790 -0.074226 0.159475 -0.113874 -0.112469 -0.103520 -0.102179 -0.101251 -0.122089 -0.113875 -0.103871 -0.102178 -0.101251 -0.112471 0.133748 0.168344 -0.224806 -0.224790 -0.024778 0.183439 -0.024799 0.183434 0.013232 0.121526 0.121526 -0.231884 0.088229 0.088213 0.121846
chargesum: -1.00000
title: Mulliken charges with hydrogens summed into heavy atoms:
elementType: B B B B B B B B B B B B I I I I I I I I I I I C C C C C C C
charge: -0.084600 -0.280966 0.159472 0.091448 -0.077790 -0.074228 0.126381 -0.084592 -0.086034 -0.077790 -0.074226 0.159475 -0.113874 -0.112469 -0.103520 -0.102179 -0.101251 -0.122089 -0.113875 -0.103871 -0.102178 -0.101251 -0.112471 0.302092 -0.041367 -0.041357 0.096748 0.096727 0.013232 0.066404
1716.lowfreq: -0.0006 -0.0006 0.0002 1.2931 1.6391 3.6938 33.9386 49.0240 54.6691
frequency: 33.9343 49.0236 54.6691 56.3451 56.7871 57.3665 60.2535 64.5901 65.8204 66.3617 68.6638 71.7138 72.3523 73.4995 73.9037 75.1200 76.7694 80.1168 84.7951 84.9922 95.1611 96.6411 108.2760 134.3944 141.0031 142.4243 142.6232 143.0389 143.7500 148.9746 150.4728 150.7531 161.8953 178.4486 274.9036 356.1058 366.0760 369.6616 371.7675 380.9605 386.8994 388.9412 439.0794 497.7666 539.0176 551.0208 554.6533 558.9642 559.4124 562.5410 626.2372 645.4129 645.6169 648.3248 650.6246 652.2284 707.5593 708.2582 713.7504 722.3699 730.5047 755.0421 762.5160 766.7564 771.5811 798.7033 818.7441 832.1780 833.0062 834.1295 840.5731 888.5030 891.5930 893.9281 898.2343 898.3465 913.7340 929.3393 932.5218 932.8365 951.1404 994.5045 1000.4120 1014.6210 1032.6963 1049.3552 1077.3949 1087.7401 1181.5420 1215.2392 1251.3888 1351.1149 1391.8503 1400.4520 1467.1829 1475.3125 1488.6364 1508.0017 1555.4713 1650.2288 3008.3697 3023.0255 3086.7270 3123.3489 3190.5896 3191.9045 3232.0954 3232.9683
redmass: 4.9084 8.0331 98.2224 77.7963 64.4815 102.7899 26.5001 75.5783 56.0389 72.1410 46.5517 94.8145 105.5427 82.7140 104.4942 105.4875 18.6293 70.1763 53.1168 31.3935 47.4096 1.0562 7.2271 6.5259 100.0106 107.3251 105.9482 18.9478 107.5636 112.2064 115.5118 68.5593 4.0450 4.3557 5.9014 2.5716 10.9914 11.0769 11.1526 11.5423 8.1766 7.4843 3.1090 2.7701 5.3942 10.7745 10.9789 10.9539 8.9672 10.4783 6.5177 10.2829 10.5987 10.8984 11.1228 8.5672 10.5850 10.9044 8.5707 10.8527 3.2840 8.6813 10.4746 10.8644 7.1854 4.5363 2.4669 5.8164 9.2366 2.6674 1.4030 8.0702 9.3455 10.3005 10.3695 10.7611 9.5825 7.4063 10.6225 10.7085 4.4661 1.3862 1.4675 1.4095 2.1409 1.7617 1.3555 1.4639 1.1031 1.1781 2.7443 1.3831 3.5813 1.2390 1.5885 1.7100 1.0815 1.9774 3.8346 5.2644 1.0829 1.0440 1.0878 1.1040 1.0897 1.0910 1.0916 1.0939
irintensity: 1.2306 1.0762 0.0020 0.0672 0.0237 0.0000 0.3402 0.0026 0.0104 0.0768 0.1299 0.0351 0.0003 0.0055 0.0246 0.0035 0.7073 0.0057 0.1233 0.2948 0.0143 0.0000 4.1950 4.6535 0.0067 0.0137 0.0008 1.1751 0.0102 0.0045 0.0030 0.1088 1.0533 0.8735 0.7710 0.1601 0.1468 2.3611 5.1835 10.5687 5.2070 12.6053 0.6604 34.2335 0.1489 0.5852 0.0558 0.0244 4.2786 0.1830 1.0193 2.2297 0.4098 0.2986 0.0060 5.3323 0.1045 0.3518 0.4081 0.0007 17.0577 5.8834 0.1629 0.1352 12.6406 1.5622 37.1352 1.1317 0.3180 13.7731 12.2455 16.2883 7.8237 1.4051 1.5392 0.0901 7.2605 239.2189 164.7617 139.0746 2.5224 15.7973 3.0270 0.0018 7.8507 12.3456 49.1484 0.1618 1.4355 18.3734 1.5003 18.2126 17.2300 19.7414 30.1574 74.9772 5.0358 25.2294 2.1907 170.8324 51.8633 3.6481 25.5137 8.7017 4.1032 4.3562 0.1575 4.8933
temp: 298.150 k
press: 1.00000 atm
elementType: 5 5 5 5 5 5 5 5 5 5 5 5 53 53 53 53 53 53 53 53 53 53 53 1 6 6 6 6 1 6 1 6 1 1 6 1 1 1
symmnumber: 1
zpe: 504221.0 jmol-1
zpe.correction: 0.192048 hartree
zpe.thermalcorrener: 0.227611 hartree
zpe.thermalcorrenthalpy: 0.228555 hartree
zpe.thermalcorrgfe: 0.116409 hartree
zpe.sumelectzpe: -3846.486101 hartree
zpe.sumelectthermal: -3846.450538 hartree
zpe.sumelectthermalent: -3846.449594 hartree
zpe.sumelectthermalfe: -3846.561740 hartree
dipole: 9.7197 -0.0000 5.2350
dipole: 11.0398
quadrupole: -409.6575 -447.8341 -441.0169
quadrupole: 0.0001 18.9218 0.0000
quadrupole: 23.1787 -14.9980 -8.1807 0.0001 18.9218 0.0000
hfenergy: -3846.678149 hartree
pointgroup: C01 [X(C7H8B12I11)]
dipole: -3.7973729 -0.0210431 2.1082194 debye
polarizability: 628.6885379|0.1251816|568.9260509|-14.5840719|0.3025068|542.7689376 unknown
InChI: InChI=1/C7H8B12I11/c1-6-2-4-7(5-3-6)8-9(20)10(8,21)12(8,23)13(8,24)11(8,9,22)15(9,26)14(9,10,25)16(10,12,27)18(12,13,29)17(11,13,15,28)19(14,15,16,18)30/h2-5,7H,1H3
charge -1 multiplicity 1
38 atoms
B  0.35334972 -0.90175838 1.45666549
B  -1.15946127 -0.00343454 1.21086519
B  -0.78341176 1.45365354 0.22831323
B  1.34656456 0.02049182 -1.07995673
B  0.96927131 -1.43165099 -0.12240201
B  -0.17698518 -0.86220676 -1.36988609
B  -1.50047533 0.0162224 -0.53573159
B  0.35447527 0.88729021 1.47658164
B  1.67263201 0.00076625 0.67346744
B  0.9710845 1.45143086 -0.09030625
B  -0.17586995 0.91134067 -1.35014236
B  -0.78523069 -1.43876237 0.19611386
I  0.64417916 -2.06252168 3.27804307
I  -1.83636427 3.36939437 0.31078948
I  2.95209322 0.03567917 -2.53481102
I  2.09426953 -3.27336601 -0.33983261
I  -0.52141322 -1.96748453 -3.20520075
I  -3.53411226 0.02627639 -1.3244242
I  0.64674396 2.00685831 3.32334078
I  3.67958882 -0.00959899 1.49135904
I  2.09839504 3.29611632 -0.26670032
I  -0.51888572 2.0576329 -3.16039214
I  -1.84057922 -3.3545471 0.23593494
H  -1.46701889 -0.02677569 3.32254925
C  -2.24849374 -0.01772588 2.55641097
C  -3.00862932 1.2057 2.53697508
C  -3.0102172 -1.23942623 2.50971283
C  -4.34046267 1.20284206 2.23152848
H  -2.49006272 2.1262119 2.74698809
C  -4.34203871 -1.22803113 2.20442088
H  -2.49284976 -2.16506559 2.6991363
C  -5.01484884 -0.00991436 2.01684505
H  -4.87787623 2.13588097 2.13786088
H  -4.88066055 -2.15805208 2.08998046
C  -6.43875467 -0.00409465 1.57653873
H  -6.96840487 -0.89794236 1.90255156
H  -6.96715199 0.88318581 1.9219876
H  -6.45121206 0.00785236 0.48204578
