program: Gaussian 16
title: Title
version: ES64L-G16RevC.02
frameworkgroup: C1[X(C7H8B12I11)]
method: RB3LYP
basis: def2TZVPP
operation: Freq
keyword: #N
keyword: Geom=AllCheck
keyword: Guess=TCheck
keyword: SCRF=Check
keyword: GenChk
keyword: RB3LYP/def2TZVPP
keyword: Freq
converged: YES YES NO NO
title: Mulliken charges:
elementType: B B B B B B B B B B B B I I I I I I I I I I I C H H C C C C H C H C H H H H
charge: 0.023123 -0.040853 0.044238 -0.005211 -0.088736 -0.078284 -0.005260 0.091573 -0.097985 -0.096792 -0.076749 0.025628 -0.070724 -0.083628 -0.091982 -0.087108 -0.087986 -0.077929 -0.066993 -0.085092 -0.087332 -0.087493 -0.086430 -0.022283 0.147832 0.138365 0.003098 -0.171596 -0.163739 -0.116175 0.143225 -0.111098 0.143514 -0.121043 0.124494 0.125272 0.120327 -0.022190
chargesum: -1.00000
title: Mulliken charges with hydrogens summed into heavy atoms:
elementType: B B B B B B B B B B B B I I I I I I I I I I I C C C C C C C
charge: 0.023123 -0.040853 0.044238 -0.005211 -0.088736 -0.078284 -0.005260 0.091573 -0.097985 -0.096792 -0.076749 0.025628 -0.070724 -0.083628 -0.091982 -0.087108 -0.087986 -0.077929 -0.066993 -0.085092 -0.087332 -0.087493 -0.086430 0.241725 0.003098 -0.028370 -0.020225 0.008319 0.014175 -0.000716
1716.lowfreq: -2.5593 -1.2807 -0.0005 -0.0002 0.0000 1.9599 3.4097 28.6074 40.4160
frequency: 2.8063 28.6005 40.4041 52.0263 52.9617 54.6542 57.1813 57.6733 60.5163 62.3779 65.7262 66.5027 68.4545 69.6574 70.5709 71.2373 71.3510 74.9307 75.7691 81.4568 81.9764 86.0957 95.2039 112.9342 126.1521 141.8305 143.2977 143.8723 143.9334 144.7244 149.3555 152.2501 152.3097 193.9313 283.3235 344.9975 348.8415 360.5192 366.3520 376.9049 382.0234 396.1957 415.9284 504.8853 544.0903 550.5775 550.8400 551.2363 556.0261 573.0349 607.9700 638.0926 642.2018 643.3236 657.2545 659.3129 708.4379 709.3089 710.7772 711.3829 711.6986 744.7655 746.5237 768.9677 786.9071 787.5750 796.1906 825.2723 843.3003 844.9462 862.0434 878.8908 894.9029 896.8888 905.5359 907.9589 913.9775 922.1828 942.4308 949.0126 952.1425 992.4984 994.2221 1005.5490 1028.8527 1055.9767 1117.4406 1185.7950 1210.5979 1223.0846 1285.9873 1309.2958 1353.4400 1377.4484 1454.2344 1497.2822 1533.4910 1631.4229 1643.3456 1714.9639 2278.7304 3125.0288 3168.9912 3180.4045 3186.7124 3194.4840 3199.3772 3203.9009
redmass: 6.1413 6.6365 4.2641 35.6027 111.1136 116.6640 86.6809 41.2383 73.1093 114.0047 81.5859 45.6279 72.2007 111.7680 124.6799 99.4096 100.4018 115.9237 121.6188 39.0094 57.0149 31.4561 8.3533 3.3518 5.1408 44.3413 94.2650 106.0338 105.2980 92.0332 102.6002 105.1433 113.7462 1.2793 3.6014 11.2184 3.4491 11.0933 9.8561 9.7328 11.6825 3.8108 2.8534 3.3198 8.4605 10.9739 10.8904 10.9999 10.4672 6.1448 8.9504 6.3366 10.9539 11.1261 10.8778 10.9268 5.5797 6.4297 2.5105 9.9159 10.8106 10.9828 10.9021 1.9945 10.2651 10.8118 6.8368 4.7188 10.7319 11.0687 1.2523 9.9703 11.0078 10.9023 10.6903 10.8927 10.3546 10.3893 3.0062 9.9562 2.1404 1.4694 1.3737 1.2959 6.0133 2.2370 1.5057 1.1174 1.1462 3.4950 1.2072 1.3667 2.8471 1.2427 1.1219 2.2065 2.1138 5.4652 4.4447 1.1721 1.0467 1.0578 1.0855 1.0880 1.0916 1.0948 1.0979 1.1126
irintensity: 0.0839 0.1874 0.0476 0.0356 0.0019 0.0020 0.0007 0.0001 0.0089 0.0014 0.0022 0.0002 0.0029 0.0011 0.0001 0.0010 0.0000 0.0011 0.0007 0.1423 0.1989 0.0987 0.5365 0.9225 4.0836 0.0298 0.0449 0.0007 0.0019 0.0263 0.0092 0.0056 0.0015 0.4988 9.7312 11.0249 2.2679 0.0195 4.7857 10.5077 17.7146 1.9056 0.0029 29.2460 3.4701 0.0008 0.0449 0.0201 0.5210 2.2741 0.6782 0.0161 0.0583 0.0097 0.0382 0.1580 6.1363 4.9999 26.1451 0.9434 0.4524 0.0168 0.1919 17.9635 2.7896 2.5958 5.8301 0.7031 0.0173 0.0221 1.0329 0.4330 1.8506 0.2863 43.6851 50.8927 5.3541 142.6472 76.7890 100.6618 30.3217 0.2921 0.2781 0.0218 0.2065 3.5998 4.4794 0.3546 10.7331 29.8629 20.5540 6.3402 0.2136 1.3686 5.4453 7.4566 1.5701 0.3853 18.2221 129.4523 450.9752 12.5445 0.9111 5.2624 13.9262 10.5141 19.1479 8.6251
temp: 298.150 k
press: 1.00000 atm
elementType: 5 5 5 5 5 5 5 5 5 5 5 5 53 53 53 53 53 53 53 53 53 53 53 6 1 1 6 6 6 6 1 6 1 6 1 1 1 1
symmnumber: 1
zpe: 501721.2 jmol-1
zpe.correction: 0.191096 hartree
zpe.thermalcorrener: 0.227148 hartree
zpe.thermalcorrenthalpy: 0.228092 hartree
zpe.thermalcorrgfe: 0.110960 hartree
zpe.sumelectzpe: -3846.464688 hartree
zpe.sumelectthermal: -3846.428635 hartree
zpe.sumelectthermalent: -3846.427691 hartree
zpe.sumelectthermalfe: -3846.544823 hartree
dipole: 7.4112 -0.0772 2.2803
dipole: 7.7545
quadrupole: -421.7580 -443.6531 -446.5802
quadrupole: -0.4055 5.6726 -0.5217
quadrupole: 15.5725 -6.3227 -9.2498 -0.4055 5.6726 -0.5217
hfenergy: -3846.6557831 hartree
pointgroup: C01 [X(C7H8B12I11)]
dipole: 2.6837508 -0.0562115 -1.4498183 debye
polarizability: 641.4988935|6.5370552|557.599452|-20.5966802|-10.6694849|545.6231001 unknown
InChI: InChI=1/C7H8B12I11/c20-8-9(21)10(8,22)12(8,24)13(8,25)11(8,9,23)15(9,27)14(9,10,26)16(10,12,28)18(12,13,30)17(11,13,15,29)19(14,15,16,18)31-6-7-4-2-1-3-5-7/h1-5H,6H2
charge -1 multiplicity 1
38 atoms
B  0.79527321 1.31696241 0.13171491
B  1.05477605 -0.1163957 -0.82434761
B  0.47945956 -1.56694146 -0.05399391
B  -1.62413243 0.06223588 1.04907415
B  -0.96771735 1.50453235 0.22458519
B  -1.71799983 0.18929563 -0.73188846
B  -0.42069685 -0.81939308 -1.42174189
B  1.23152805 -0.25108089 0.90381973
B  -0.06654228 0.75744556 1.5822541
B  -0.26628266 -1.02044093 1.46746493
B  -1.28444734 -1.37170387 0.03646458
B  -0.22418698 0.96471629 -1.30059304
I  2.21827281 2.9547272 0.09458685
I  1.47820648 -3.48026711 -0.29565229
I  -3.39629474 0.1791038 2.28647526
I  -1.86810635 3.46529758 0.39125573
I  -3.59042301 0.46835449 -1.78238626
I  -0.58269761 -1.81052865 -3.3446526
I  3.18036516 -0.52299063 1.81707257
I  0.18668444 1.76314425 3.48109866
I  -0.27187095 -2.28699887 3.22236256
I  -2.60189803 -3.08817175 -0.03255816
I  -0.09663124 2.19161809 -3.08731579
C  2.60140863 -0.39954169 -2.26818557
H  2.07577028 0.16387657 -3.02915859
H  2.35807726 -1.45370255 -2.28605322
C  4.06573173 -0.11813749 -2.18610779
C  4.56418381 1.11099513 -2.61358937
C  4.92907313 -1.0725747 -1.65189942
C  5.92323852 1.3748285 -2.52671225
H  3.8827725 1.85782602 -2.99735054
C  6.28770103 -0.80579472 -1.5672628
H  4.52806826 -2.00974657 -1.29103207
C  6.78560715 0.41694679 -2.00410655
H  6.30753184 2.33025291 -2.85678109
H  6.95541958 -1.54694693 -1.14981168
H  7.84449207 0.62643669 -1.93054181
H  2.3272937 0.07457457 -1.22118975
