program: Gaussian 16
title: Title
version: ES64L-G16RevC.02
frameworkgroup: C1[X(C7H8B12I11)]
method: RB3LYP
basis: def2TZVPP
operation: Freq
keyword: #N
keyword: Geom=AllCheck
keyword: Guess=TCheck
keyword: SCRF=Check
keyword: GenChk
keyword: RB3LYP/def2TZVPP
keyword: Freq
converged: YES YES YES YES
title: Mulliken charges:
elementType: B B B B B B B B B B B B I I I I I I I I I I I H C C C C H C H C H H C H H H
charge: -0.356789 0.267241 -0.036988 0.020664 -0.044312 -0.045786 -0.036973 0.113876 -0.044314 -0.045774 -0.099344 0.113858 0.258900 -0.116682 -0.098719 -0.096848 -0.100721 -0.116682 -0.127145 -0.096848 -0.100721 -0.102584 -0.127143 0.100546 0.017860 -0.169856 -0.169846 -0.183304 0.141876 -0.183295 0.141864 0.074811 0.114846 0.114845 -0.248833 0.086446 0.086438 0.095435
chargesum: -1.00000
title: Mulliken charges with hydrogens summed into heavy atoms:
elementType: B B B B B B B B B B B B I I I I I I I I I I I C C C C C C C
charge: -0.356789 0.267241 -0.036988 0.020664 -0.044312 -0.045786 -0.036973 0.113876 -0.044314 -0.045774 -0.099344 0.113858 0.258900 -0.116682 -0.098719 -0.096848 -0.100721 -0.116682 -0.127145 -0.096848 -0.100721 -0.102584 -0.127143 0.118406 -0.027980 -0.027983 -0.068458 -0.068450 0.074811 0.019486
1716.lowfreq: -418.1594 -0.0006 -0.0004 -0.0003 0.2540 1.7606 3.2188 27.4331 31.8746
frequency: -418.1594 27.4308 31.8746 43.5647 48.5216 50.4144 55.4586 56.8378 58.4275 64.3644 65.4277 66.4292 67.6281 70.6170 70.9717 72.8644 73.0677 75.4230 76.8650 81.7361 83.9448 86.4209 95.1855 113.6338 139.1520 141.2957 142.0942 143.3092 143.6949 147.7898 150.0782 151.1308 160.9471 184.1344 187.5949 343.1028 350.2113 363.7985 370.9706 371.5199 381.1680 404.8369 405.3808 418.0771 524.0081 553.2113 556.6068 558.7138 561.6031 568.0674 573.5252 587.2428 639.7460 642.7752 652.3099 654.7541 666.2740 682.9008 711.7002 715.4156 716.6174 723.8328 737.3866 752.7287 765.1663 782.2798 786.4905 814.0959 820.3407 836.2778 837.1456 853.7323 859.4501 893.5161 894.0327 901.9519 903.5035 911.1270 922.4443 937.5121 938.2827 961.8328 999.8974 1006.3824 1010.9611 1045.5706 1062.9262 1158.7817 1192.6475 1204.3084 1236.0932 1260.6304 1313.6580 1364.8497 1412.7476 1437.4901 1485.7690 1489.4636 1550.0252 1583.0104 1654.7277 3023.7807 3078.1068 3108.0362 3164.6997 3166.0509 3244.4583 3244.7493
redmass: 1.4041 2.3527 5.0132 1.3937 19.6628 57.3539 73.9893 87.9079 92.0539 29.4067 95.6889 33.3331 110.1968 103.1163 110.6799 100.1757 47.0564 92.2174 32.5558 71.3301 37.8458 63.2315 36.8306 6.3173 24.8499 89.7068 85.7006 108.4711 88.4981 57.3258 88.4413 108.5505 6.3214 5.4235 5.9573 4.5951 2.9393 11.0732 11.1860 11.6312 9.1003 5.6315 2.8030 7.2284 3.2910 4.2490 8.3611 10.0445 6.1831 1.3029 9.3949 5.2969 9.9085 9.7163 10.4059 10.6795 6.7989 8.1995 10.8787 10.7000 6.7535 10.6997 3.6428 10.8497 8.6524 5.6959 10.9296 4.9625 9.5973 1.7358 9.3514 1.2758 8.0781 10.9504 9.4081 9.1149 10.9528 10.5752 9.3382 9.7210 10.8645 5.4082 1.3298 1.4035 1.4156 2.8367 1.5932 1.4319 2.0402 1.8052 1.3712 2.0150 5.6377 1.3968 1.2553 2.4608 1.1095 1.0544 2.1015 4.2163 5.2213 1.0418 1.0920 1.1026 1.0895 1.0903 1.0891 1.0915
irintensity: 1940.8986 0.1735 0.6004 0.0006 0.0195 0.1047 0.0702 0.0298 0.0324 0.0081 0.0185 0.1996 0.3365 0.0079 0.1009 0.2936 0.0156 0.7739 0.0020 0.2760 0.9033 0.8580 0.4590 0.2082 0.3296 0.0009 0.0238 0.0054 0.0489 0.0159 0.0209 0.0061 0.6951 0.1558 9.6355 95.4026 0.4556 0.1463 17.0065 6.8050 65.7161 3.4202 0.2238 7.7184 27.8452 0.1779 0.0011 2.2948 6.1861 1.3909 1.6777 9.9071 0.0355 2.3650 2.4249 0.1357 0.0120 6.0514 0.1836 1.6294 1.1247 0.1519 1.0870 0.0469 0.7004 2.8331 0.3151 6.1016 5.2847 25.9286 0.0006 0.9397 2.6982 1.4440 12.3861 11.1764 9.0004 55.8127 68.7866 104.4574 138.4297 40.1916 3.1726 0.7790 0.2211 11.1494 14.0651 0.0950 511.0361 270.3999 80.2320 1.1123 1.8423 0.2392 1.2302 6.4111 11.9208 5.9613 50.2680 1.3658 37.7485 36.9194 19.2425 12.6601 15.6505 22.3923 3.6201 20.9004
temp: 298.150 k
press: 1.00000 atm
elementType: 5 5 5 5 5 5 5 5 5 5 5 5 53 53 53 53 53 53 53 53 53 53 53 1 6 6 6 6 1 6 1 6 1 1 6 1 1 1
symmnumber: 1
zpe: 487692.5 jmol-1
zpe.correction: 0.185752 hartree
zpe.thermalcorrener: 0.221291 hartree
zpe.thermalcorrenthalpy: 0.222235 hartree
zpe.thermalcorrgfe: 0.108962 hartree
zpe.sumelectzpe: -3846.467720 hartree
zpe.sumelectthermal: -3846.432181 hartree
zpe.sumelectthermalent: -3846.431237 hartree
zpe.sumelectthermalfe: -3846.544510 hartree
dipole: 8.6967 0.0001 -4.2516
dipole: 9.6803
quadrupole: -415.0508 -449.1781 -439.4963
quadrupole: 0.0004 -8.3739 -0.0005
quadrupole: 19.5243 -14.6031 -4.9212 0.0004 -8.3739 -0.0005
hfenergy: -3846.6534721 hartree
pointgroup: C01 [X(C7H8B12I11)]
dipole: 2.4315693 0.8482442 2.8058558 debye
polarizability: 645.4211898|-5.7048064|556.7427663|31.8657737|-9.3060738|558.6419647 unknown
InChI: InChI=1/C7H8B12I11/c1-6-2-4-7(5-3-6)8-9(20)10(8,21)12(8,23)13(8,24)11(8,9,22)15(9,26)14(9,10,25)16(10,12,27)18(12,13,29)17(11,13,15,28)19(14,15,16,18)30/h2-5,20H,1H3
charge -1 multiplicity 1
38 atoms
B  -0.14534149 0.73831382 1.32518317
B  1.29427316 -0.01952269 0.62235361
B  0.66892313 -1.39636308 -0.3220866
B  -1.80322326 0.02079651 -0.84902585
B  -1.20816827 1.40634056 0.10030553
B  -0.45461658 1.00833101 -1.47265534
B  1.07754316 0.13863577 -1.14024072
B  -0.10027089 -1.0141584 1.22845232
B  -1.61601641 -0.12575194 0.91691008
B  -1.11432464 -1.46988442 -0.15176847
B  -0.38763816 -0.76574007 -1.61770034
B  0.56336138 1.47879638 -0.10029071
I  0.42936174 1.62453508 3.27490757
I  1.88432641 -3.18163217 -0.56387248
I  -3.76181435 0.04955415 -1.77327711
I  -2.38332998 3.19477331 0.4669451
I  -0.69523815 2.2935598 -3.20142663
I  2.81665703 0.32073986 -2.43065795
I  -0.06646132 -2.30695075 2.99850522
I  -3.29420525 -0.22695203 2.29072303
I  -2.19684854 -3.34728881 -0.19486124
I  -0.53033845 -1.75313333 -3.5414899
I  1.47233352 3.47353769 -0.08248168
H  1.95224499 0.89181249 2.66076835
C  2.69589265 0.01662707 1.39018493
C  3.13182817 -1.05872722 2.20169634
C  3.6787455 0.99568247 1.10659269
C  4.39698837 -1.09782146 2.75687207
H  2.46201867 -1.87661124 2.39778519
C  4.94320844 0.95396876 1.66316579
H  3.44145236 1.80246428 0.4366493
C  5.32485143 -0.08636798 2.50992092
H  4.67580513 -1.94183963 3.37532332
H  5.65403982 1.73275264 1.41658322
C  6.68905663 -0.11595845 3.13566898
H  7.02053391 -1.13852071 3.31543646
H  7.4252464 0.38224846 2.50507576
H  6.6817637 0.39974925 4.09982708
