program: Gaussian 09
title: 000077509
version: EM64L-G09RevD.01
frameworkgroup: C1[X(C18H24)]
method: RPBEPBE
basis: SDD
operation: Freq
keyword: #p
keyword: freq=noraman
keyword: PBEPBE/SDD
title: #p freq=noraman PBEPBE/SDD
converged: YES YES NO YES
title: Mulliken charges:
elementType: C C C C C C C C C C C C C C C C C C H H H H H H H H H H H H H H H H H H H H H H H H
charge: 0.123004 0.123003 0.529387 0.529387 0.382591 0.382593 -0.632132 -0.632136 -0.701396 -0.701419 -0.750777 -0.701401 -0.701414 -0.750776 -0.421554 -0.421551 -0.491779 -0.491780 0.256389 0.256389 0.207483 0.216105 0.223719 0.216074 0.207484 0.223725 0.217711 0.217339 0.217363 0.207483 0.216098 0.223720 0.216082 0.207484 0.223724 0.217710 0.217344 0.217357 0.226488 0.226488 0.234197 0.234197
chargesum: 0.00000
title: Mulliken charges with hydrogens summed into heavy atoms:
elementType: C C C C C C C C C C C C C C C C C C
charge: 0.123004 0.123003 0.529387 0.529387 0.382591 0.382593 -0.375743 -0.375747 -0.054090 -0.054137 -0.098365 -0.054100 -0.054125 -0.098364 -0.195066 -0.195063 -0.257582 -0.257584
polarizability: 3.08018663e+02 1.04767313e+01 1.84388614e+02 1.02710520e-02 8.47233194e-03 1.25434424e+02
1716.lowfreq: -7.2484 -0.0007 -0.0001 0.0007 5.7416 11.2248 33.3808 48.0102 58.8106
frequency: 33.3808 48.0102 58.1819 120.0370 121.0098 183.0382 199.2692 200.8238 209.8197 221.7694 234.7694 253.7274 257.4589 286.8862 305.6074 307.9290 316.3754 329.7785 348.7328 356.7347 381.2199 381.4102 413.9337 444.9465 463.6175 483.7045 489.5926 493.6982 523.4583 550.8769 610.1804 650.6169 686.3697 700.0678 782.0704 793.2452 802.8992 825.1788 833.0905 846.9536 909.0841 909.2264 916.0223 921.5651 922.0319 931.5919 931.7760 941.8355 942.2494 952.2107 971.8705 976.3624 1020.8767 1022.1229 1024.7045 1024.7994 1096.4717 1101.5490 1151.8624 1174.0761 1205.4439 1205.4621 1212.5878 1213.4468 1220.4178 1244.1458 1279.4092 1282.4977 1287.9726 1336.4691 1374.4184 1374.4264 1375.7090 1378.1121 1393.2428 1403.8536 1405.6385 1413.6151 1431.3083 1460.5476 1460.5502 1465.6543 1465.7008 1467.4556 1467.5069 1474.2512 1480.1128 1485.7027 1486.4271 1486.4453 1497.3052 1500.2859 1503.2174 1576.7179 1609.8111 1642.4681 2972.1456 2972.1667 2973.0343 2973.0628 2978.4336 2978.7299 3067.5412 3067.5613 3067.5756 3067.5854 3069.8750 3069.9155 3076.0035 3076.4218 3078.8990 3078.9350 3082.4441 3082.4514 3111.6556 3111.9143 3136.3470 3137.3193 3140.8735 3143.3913
redmass: 2.7535 3.6927 3.3256 3.7503 3.1942 2.8655 1.5640 3.2568 1.0584 3.1500 1.7347 1.0536 1.0811 2.5496 1.0749 1.0692 2.6501 2.4311 3.1572 2.3637 2.7087 2.5069 3.0856 2.8531 3.7451 2.5672 3.3257 2.6713 6.8809 2.9423 2.7296 6.4332 5.2666 3.2029 4.6215 2.6703 3.1758 1.5820 1.3466 2.6423 3.6436 1.6245 1.8072 1.5660 1.5737 1.6616 1.6655 1.2080 1.2064 3.6822 1.3856 1.3797 1.4090 1.3980 1.3814 1.3808 2.1387 2.0261 1.6779 1.2255 2.9541 2.9547 2.4987 2.6309 1.8752 1.6249 3.0835 2.0976 2.0914 1.6989 1.1855 1.1854 1.2845 1.2501 2.3208 1.2528 1.2681 4.2065 7.6641 1.0509 1.0508 1.0480 1.0480 1.1396 1.0724 1.4682 1.1021 1.2447 1.0506 1.0507 1.0930 1.1795 2.8077 6.8474 5.8401 6.8021 1.0350 1.0350 1.0346 1.0346 1.0357 1.0357 1.1001 1.1001 1.0998 1.0998 1.1003 1.1003 1.0987 1.0985 1.0995 1.0995 1.0989 1.0989 1.0867 1.0861 1.0942 1.0955 1.0911 1.0916
irintensity: 0.0981 0.4622 0.0000 0.3952 0.0000 0.2173 0.9928 0.0002 0.0000 0.0000 0.0359 0.0128 0.0000 0.2479 0.0000 0.1582 0.0000 0.0000 0.2613 0.7043 0.6938 0.0015 0.0000 0.0000 0.8215 14.6008 0.1673 0.0000 0.0000 0.8463 0.0000 1.5803 0.0000 15.7482 0.0000 0.0000 4.6839 0.0000 39.2707 0.0000 30.6643 21.2799 0.0000 24.6371 0.0001 0.0001 4.9833 0.0000 2.6887 0.0000 0.0000 4.9595 0.0000 8.2572 0.0000 0.6432 15.3101 0.0000 23.6228 0.0000 13.7892 0.0095 2.1017 0.0000 61.2028 0.0000 22.1518 0.0000 38.5595 0.7622 0.0073 38.9116 0.0006 50.8824 0.0000 23.1577 0.0000 4.2908 0.0000 0.0045 0.0000 0.0002 0.9583 0.0002 0.5890 0.0000 34.2632 0.0100 0.0028 22.9376 35.9925 0.0000 27.6161 0.0000 39.5113 0.0000 0.2122 59.3377 0.1305 67.4360 83.8336 0.0016 0.0624 4.1079 0.1591 4.5524 0.1162 43.8202 286.2317 0.0019 0.0680 60.8138 0.5512 99.3739 14.2622 0.0005 0.0009 72.4772 17.2174 0.0001
temp: 298.150 k
press: 1.00000 atm
elementType: 6 6 6 6 6 6 6 6 6 6 6 6 6 6 6 6 6 6 1 1 1 1 1 1 1 1 1 1 1 1 1 1 1 1 1 1 1 1 1 1 1 1
symmnumber: 1
zpe: 959855.9 jmol-1
zpe.correction: 0.365590 hartree
zpe.thermalcorrener: 0.383969 hartree
zpe.thermalcorrenthalpy: 0.384914 hartree
zpe.thermalcorrgfe: 0.320742 hartree
zpe.sumelectzpe: -698.990395 hartree
zpe.sumelectthermal: -698.972016 hartree
zpe.sumelectthermalent: -698.971072 hartree
zpe.sumelectthermalfe: -699.035243 hartree
dipole: 0.0000 0.0000 0.0002
dipole: 0.0002
quadrupole: -98.4285 -103.8006 -115.8386
quadrupole: -0.4019 0.0009 0.0016
quadrupole: 7.5940 2.2220 -9.8160 -0.4019 0.0009 0.0016
hfenergy: -699.3559852 hartree
pointgroup: C01 [X(C18H24)]
dipole: -0.0000009 0.0000012 -0.0000669 debye
polarizability: 308.2153119|-9.2418349|184.1919649|-0.010355|0.0083695|125.4344242 unknown
InChI: InChI=1S/C18H24/c1-17(2,3)15-9-7-14-12-16(18(4,5)6)10-8-13(14)11-15/h7-12H,1-6H3
charge 0 multiplicity 1
42 atoms
C  4.119931 0.145807 -0.000497
C  -4.11997 -0.145661 -0.000115
C  2.592953 -0.098259 -0.000336
C  -2.592991 0.098396 -0.000087
C  0.239133 0.681419 -0.000142
C  -0.23917 -0.681283 -0.000304
C  1.650388 0.937389 -0.000148
C  -1.650426 -0.937252 -0.000261
C  4.746358 -0.503357 -1.272577
C  4.747085 -0.504909 1.270411
C  4.478475 1.653455 0.000363
C  -4.746643 0.504118 -1.271753
C  -4.746859 0.504459 1.271233
C  -4.478533 -1.653307 0.000082
C  2.098147 -1.451926 -0.000542
C  -2.098183 1.452065 0.000037
C  0.733383 -1.734979 -0.000509
C  -0.73342 1.735116 0.000022
H  1.977877 1.982609 0.00002
H  -1.977911 -1.982472 -0.000353
H  5.842449 -0.352481 -1.27695
H  4.553728 -1.590156 -1.315063
H  4.329312 -0.049799 -2.190246
H  4.554694 -1.591798 1.311637
H  5.843155 -0.353871 1.274387
H  4.33047 -0.0526 2.188893
H  5.577556 1.772781 0.000209
H  4.085002 2.168102 -0.895791
H  4.085348 2.166973 0.897318
H  -5.842732 0.353225 -1.275984
H  -4.55405 1.590943 -1.313749
H  -4.329769 0.051019 -2.189727
H  -4.554377 1.591313 1.312957
H  -5.842938 0.353493 1.275337
H  -4.330102 0.051664 2.189409
H  -5.577616 -1.77262 0.00008
H  -4.085234 -2.167522 -0.896396
H  -4.085247 -2.167267 0.896713
H  2.813434 -2.282706 -0.00072
H  -2.813472 2.282842 0.000152
H  0.387973 -2.776354 -0.000647
H  -0.388007 2.77649 0.000135
