program: Gaussian 09
title: 000077505
version: EM64L-G09RevD.01
frameworkgroup: C1[X(C12H27O4P)]
method: RPBEPBE
basis: SDD
operation: Freq
keyword: #p
keyword: freq=noraman
keyword: PBEPBE/SDD
title: #p freq=noraman PBEPBE/SDD
converged: YES YES NO NO
title: Mulliken charges:
elementType: P O O O O C C C C C C C C C C C C H H H H H H H H H H H H H H H H H H H H H H H H H H H
charge: 1.397943 -0.513245 -0.534511 -0.679610 -0.599490 -0.368060 -0.366935 -0.346099 -0.345196 -0.377601 -0.371752 -0.354382 -0.354333 -0.267287 -0.287675 -0.693385 -0.693109 0.187654 0.192868 0.190056 0.194166 0.190070 0.192886 0.190749 0.189216 0.212467 0.219226 0.211939 0.211991 0.194316 0.195896 0.196639 0.195467 0.219001 0.240493 0.215617 0.242300 0.211323 0.210159 0.216418 0.210445 0.209924 0.217435 0.396006
chargesum: 0.00000
title: Mulliken charges with hydrogens summed into heavy atoms:
elementType: P O O O O C C C C C C C C C C C C
charge: 1.397943 -0.513245 -0.534511 -0.283604 -0.599490 0.012462 0.017287 0.036857 0.034769 0.054091 0.052178 0.035831 0.037773 0.192207 0.170242 -0.055485 -0.055305
polarizability: 2.10004356e+02 2.84374766e+00 1.67438371e+02 -2.10704500e+00 -1.41379714e+00 1.43543174e+02
1716.lowfreq: -7.4389 -3.1136 -0.0002 0.0008 0.0017 6.6514 13.2990 28.2377 37.3081
frequency: 7.2838 28.0027 37.1782 45.0299 49.4168 53.5092 60.2386 70.3239 86.2326 94.5412 110.4881 121.0857 129.5584 130.4144 136.5476 142.2425 158.5180 193.8184 201.9054 233.6899 237.3389 243.5197 244.5824 272.9337 337.5284 343.8945 360.1132 385.7280 435.4026 444.9328 464.8038 469.4345 642.4056 725.5355 726.4328 727.2972 736.5823 749.2175 749.5161 796.9538 798.3767 883.2339 883.6455 887.4452 888.2468 929.5111 935.8185 984.5015 985.5279 1007.7019 1008.2769 1011.8299 1042.8353 1044.9253 1064.7371 1068.3119 1074.1802 1080.3116 1085.8928 1123.3971 1124.2944 1144.6161 1147.5607 1193.3887 1195.7451 1233.8362 1236.7496 1242.6842 1244.9217 1273.2874 1275.0579 1287.0536 1288.4336 1290.0139 1290.9619 1291.0760 1293.1590 1338.0916 1339.3629 1355.1385 1357.1608 1368.8210 1370.8321 1389.3448 1389.4158 1464.1666 1465.3601 1465.4747 1466.8450 1471.2776 1472.7292 1477.0681 1478.1648 1479.0565 1479.7923 1486.3725 1487.1292 1490.9618 1491.6484 2954.4307 2955.5926 2959.1066 2959.8056 2969.4631 2969.5308 2972.7122 2973.0718 2981.8676 2989.9869 2992.5369 2992.6073 2994.1930 2999.0870 3008.3651 3008.4688 3030.5824 3032.7415 3041.7988 3050.3301 3068.6392 3069.6781 3071.2652 3072.4595 3072.9633 3079.1112 3608.1354
redmass: 4.2322 3.0310 2.0870 2.6918 2.6413 2.3783 3.9476 3.2327 1.9167 1.8878 2.6450 3.6971 2.3767 3.0428 2.0960 2.1035 1.9405 4.3786 5.8418 1.0963 1.1206 3.6986 2.9506 4.1933 4.1343 5.4797 5.8878 3.8340 4.0179 3.2523 4.2524 4.4689 9.7908 1.9127 1.9085 1.1029 7.9879 1.0935 1.1030 1.1437 1.1457 1.1890 1.1947 1.9303 1.9284 8.6333 7.8409 1.1365 1.1415 3.7747 3.7189 1.2366 3.3147 3.2723 3.8386 2.7552 3.5781 2.2947 2.3303 2.6945 2.7568 1.3922 1.4202 1.5528 1.5463 1.2834 1.2808 1.3034 1.3038 1.1025 1.0946 1.1132 1.1130 1.1291 1.1459 1.2010 1.3039 1.4039 1.3972 1.6471 1.6411 1.4166 1.4000 1.2181 1.2169 1.0738 1.0739 1.0735 1.0723 1.0758 1.0767 1.0434 1.0423 1.0762 1.0774 1.0803 1.0814 1.0939 1.0924 1.0591 1.0588 1.0592 1.0589 1.0594 1.0595 1.0362 1.0362 1.0576 1.0588 1.0977 1.0970 1.0597 1.0589 1.1015 1.1020 1.1039 1.1040 1.1056 1.1035 1.1034 1.1008 1.1053 1.0994 1.0993 1.1078 1.0663
irintensity: 0.0155 0.2130 0.7957 0.5183 0.2074 1.4153 0.3431 0.0878 0.9269 1.2018 17.4257 5.1045 1.3473 5.5594 2.3057 5.1005 37.6976 19.3243 7.5577 0.0095 0.2575 2.1168 14.6295 24.3635 42.3529 40.0788 37.7017 5.3286 6.9179 4.5071 16.3796 5.9769 19.7078 76.4291 169.1553 31.3445 169.6050 0.4734 2.5529 2.6945 1.0818 0.9828 1.8215 23.8707 20.9088 319.5175 114.5628 0.3212 0.3164 6.6887 2.9905 104.7492 37.2770 30.0614 86.9172 18.8369 44.6336 14.2090 9.6493 4.2051 19.5319 1.9851 1.2493 0.0384 0.0284 7.8698 10.0418 0.0321 0.1732 0.2100 0.3162 0.1327 0.0218 1.1815 0.1516 1.9522 1.7648 0.5627 0.3354 0.4619 0.5817 6.8895 15.3763 11.8657 10.9621 0.0982 0.2007 0.2071 0.2175 2.1769 1.2556 12.4211 12.5599 0.4257 0.0869 8.3104 4.3049 42.3139 7.4635 0.6376 0.6995 5.4469 4.9174 3.2882 165.9244 42.4552 36.9530 18.4655 9.7334 1.2114 1.6331 54.7560 55.0052 0.8814 0.4691 31.5325 43.2454 10.8300 11.0510 5.9934 71.6517 158.4595 52.0957 53.5153 83.9081 59.7095
temp: 298.150 k
press: 1.00000 atm
elementType: 15 8 8 8 8 6 6 6 6 6 6 6 6 6 6 6 6 1 1 1 1 1 1 1 1 1 1 1 1 1 1 1 1 1 1 1 1 1 1 1 1 1 1 1
symmnumber: 1
zpe: 995822.2 jmol-1
zpe.correction: 0.379289 hartree
zpe.thermalcorrener: 0.403201 hartree
zpe.thermalcorrenthalpy: 0.404145 hartree
zpe.thermalcorrgfe: 0.320888 hartree
zpe.sumelectzpe: -1114.155371 hartree
zpe.sumelectthermal: -1114.131459 hartree
zpe.sumelectthermalent: -1114.130515 hartree
zpe.sumelectthermalfe: -1114.213771 hartree
dipole: 0.8986 -3.7151 2.4568
dipole: 4.5437
quadrupole: -102.1661 -125.9011 -116.7712
quadrupole: 2.6958 -0.3826 12.1219
quadrupole: 12.7800 -10.9549 -1.8250 2.6958 -0.3826 12.1219
hfenergy: -1114.5346597 hartree
pointgroup: C01 [X(C12H27O4P1)]
dipole: -0.3504045 1.433952 1.008291 debye
polarizability: 210.0151279|2.6369059|167.3175569|2.3010058|2.1059502|143.6532162 unknown
InChI: InChI=1S/C12H27O4P/c1-3-5-7-9-11-15-17(13,14)16-12-10-8-6-4-2/h13H,3-12H2,1-2H3
charge 0 multiplicity 1
44 atoms
P  -0.00935 -2.450015 -0.187243
O  1.433088 -1.665079 -0.656096
O  -1.09765 -1.242271 0.42526
O  0.49531 -3.123817 1.317316
O  -0.611928 -3.401132 -1.298354
C  4.158678 0.782549 0.433811
C  -4.225119 0.764339 -0.490014
C  5.327863 1.440795 -0.333366
C  -5.244076 1.545309 0.370495
C  3.31637 -0.159045 -0.460581
C  -3.119109 0.094484 0.360562
C  6.165905 2.399592 0.542889
C  -6.356742 2.217472 -0.465967
C  2.167931 -0.796393 0.319726
C  -2.116608 -0.666484 -0.506852
C  7.334709 3.049499 -0.229016
C  -7.369765 2.998106 0.399181
H  3.507368 1.575761 0.856873
H  4.562923 0.214907 1.297497
H  -3.763138 1.455584 -1.225282
H  -4.761416 -0.007418 -1.080225
H  4.927408 1.99824 -1.205556
H  5.988495 0.650346 -0.745937
H  -5.706866 0.857329 1.108237
H  -4.710283 2.320028 0.959598
H  2.902716 0.403361 -1.319174
H  3.956051 -0.960409 -0.875946
H  -3.573599 -0.606762 1.086226
H  -2.57873 0.86242 0.946834
H  5.504937 3.191187 0.95153
H  6.561882 1.843135 1.416854
H  -6.890121 1.441878 -1.052749
H  -5.89361 2.902356 -1.205313
H  1.470471 -0.035145 0.720419
H  2.529432 -1.431501 1.148391
H  -1.605998 0.010477 -1.219153
H  -2.597312 -1.487682 -1.071785
H  8.030867 2.281149 -0.614997
H  6.963143 3.629482 -1.094897
H  7.91354 3.736752 0.414987
H  -7.865461 2.329978 1.128572
H  -6.867799 3.802568 0.969277
H  -8.15713 3.464236 -0.221086
H  -0.231576 -3.515666 1.863051
