program: Gaussian 16
title: Ger calculation with scalingfactor = 0.952
version: ES64L-G16RevC.01
frameworkgroup: C2V[X(C8H8)]
method: RPBEPBE
basis: def2TZVP
operation: Freq
keyword: #P
keyword: Geom=AllCheck
keyword: Guess=TCheck
keyword: SCRF=Check
keyword: GenChk
keyword: RPBEPBE/def2TZVP
keyword: Freq
converged: YES YES YES YES
title: Mulliken charges:
elementType: C C C C C H C H H H C H C H H H
charge: -0.012279 -0.012279 -0.012279 -0.012279 -0.172339 0.085891 -0.172339 0.085891 0.098726 0.098726 -0.172339 0.085891 -0.172339 0.085891 0.098726 0.098726
chargesum: -0.00000
title: Mulliken charges with hydrogens summed into heavy atoms:
elementType: C C C C C C C C
charge: 0.073612 0.073612 0.073612 0.073612 -0.073612 -0.073612 -0.073612 -0.073612
polarizability: 8.34540560e+01 3.39829959e-09 8.63644345e+01 -9.23492216e-09 -3.82422360e-09 7.98581446e+01
1716.lowfreq: -10.4196 0.0003 0.0003 0.0005 8.4228 9.6356 158.4707 236.3519 323.6727
frequency: 158.4681 236.3519 323.6723 428.0666 445.3706 724.9133 737.3273 737.6973 787.6277 814.9942 825.0854 854.4317 857.5984 883.2345 901.7742 925.4478 944.7511 955.8875 975.3583 986.1079 1041.9415 1048.6342 1116.1345 1117.2776 1124.7795 1125.8072 1136.8043 1156.0984 1194.8890 1262.4768 1273.5266 1296.9075 1559.3495 1566.9265 3025.7965 3033.1272 3036.2492 3046.9760 3087.9515 3089.6321 3117.6698 3120.2972
redmass: 2.9496 3.2713 2.8842 2.5377 2.6962 1.5400 2.5210 4.1163 1.3873 2.9798 1.6572 2.7633 1.7290 1.5380 1.5509 1.7626 2.5716 2.7045 1.3532 1.5568 1.7517 1.5515 1.4032 1.6275 1.4092 2.6988 1.3626 1.6310 1.3290 1.9034 1.8029 2.2053 5.7307 5.6893 1.0860 1.0873 1.0856 1.0907 1.0836 1.0840 1.1126 1.1123
irintensity: 0.0000 0.1715 0.5526 17.0013 0.0000 10.6629 12.7674 0.0000 94.5916 0.5954 11.4016 0.7569 0.0000 2.1396 5.1300 0.0000 14.4474 0.0000 0.5043 4.8219 0.0209 0.0857 0.1868 0.7235 0.0000 0.1894 6.1582 6.8421 0.0000 3.8452 32.0789 0.0000 4.5933 0.0295 0.0000 12.7769 38.2083 66.8851 0.0000 37.6217 21.9525 31.4086
temp: 298.150 k
press: 1.00000 atm
elementType: 6 6 6 6 6 1 6 1 1 1 6 1 6 1 1 1
symmnumber: 2
zpe: 335453.3 jmol-1
zpe.correction: 0.127767 hartree
zpe.thermalcorrener: 0.133917 hartree
zpe.thermalcorrenthalpy: 0.134862 hartree
zpe.thermalcorrgfe: 0.098670 hartree
zpe.sumelectzpe: -309.093727 hartree
zpe.sumelectthermal: -309.087577 hartree
zpe.sumelectthermalent: -309.086633 hartree
zpe.sumelectthermalfe: -309.122824 hartree
dipole: -0.0000 -0.0000 0.1778
dipole: 0.1778
quadrupole: -50.3307 -45.2263 -45.6223
quadrupole: -0.0000 0.0000 -0.0000
quadrupole: -3.2709 1.8334 1.4375 -0.0000 0.0000 -0.0000
hfenergy: -309.2214944 hartree
pointgroup: C02V [X(C8H8)]
dipole: 0. 0. 0.0699404 debye
dipolederiv: 0.1116211 0.1079995 -0.0694956 -0.0419213 -0.0957119 -0.0865491 -0.0233392 -0.0530754 0.0433444 0.1116211 -0.1079995 -0.0694956 0.0419213 -0.0957119 0.0865491 -0.0233392 0.0530754 0.0433444 0.1116211 0.1079995 0.0694956 -0.0419213 -0.0957119 0.0865491 0.0233392 0.0530754 0.0433444 0.1116211 -0.1079995 0.0694956 0.0419213 -0.0957119 -0.0865491 0.0233392 -0.0530754 0.0433444 -0.2057102 0.0126507 -0.1175451 -0.0535515 0.0732401 -0.0470745 -0.1464317 -0.2133176 0.0506892 -0.0311989 -0.0599308 -0.0612169 -0.0352146 0.0142799 -0.0870182 -0.0398129 -0.1226129 -0.0655759 -0.2057102 -0.0126507 -0.1175451 0.0535515 0.0732401 0.0470745 -0.1464317 0.2133176 0.0506892 -0.0311989 0.0599308 -0.0612169 0.0352146 0.0142799 0.0870182 -0.0398129 0.1226129 -0.0655759 0.1252879 -0.0303883 0.067969 -0.0396381 0.0081919 0.084166 0.128384 0.1101729 -0.0284577 0.1252879 0.0303883 0.067969 0.0396381 0.0081919 -0.084166 0.128384 -0.1101729 -0.0284577 -0.2057102 0.0126507 0.1175451 -0.0535515 0.0732401 0.0470745 0.1464317 0.2133176 0.0506892 -0.0311989 -0.0599308 0.0612169 -0.0352146 0.0142799 0.0870182 0.0398129 0.1226129 -0.0655759 -0.2057102 -0.0126507 0.1175451 0.0535515 0.0732401 -0.0470745 0.1464317 -0.2133176 0.0506892 -0.0311989 0.0599308 0.0612169 0.0352146 0.0142799 -0.0870182 0.0398129 -0.1226129 -0.0655759 0.1252879 0.0303883 -0.067969 0.0396381 0.0081919 0.084166 -0.128384 0.1101729 -0.0284577 0.1252879 -0.0303883 -0.067969 -0.0396381 0.0081919 -0.084166 -0.128384 -0.1101729 -0.0284577 unknown
polarizability: 83.454056|0.|86.3644345|0.|0.|79.8581446 unknown
InChI: InChI=1/C8H8/c1-2-6-5(1)7-3-4-8(6)7/h1-8H
charge 0 multiplicity 1
16 atoms
C  -0.79811662 -0.78252657 0.66344318
C  -0.79811662 0.78252657 0.66344318
C  0.79811662 0.78252657 0.66344318
C  0.79811662 -0.78252657 0.66344318
C  1.49057354 0.67499433 -0.67323764
H  1.25844789 1.36107491 1.47361602
C  1.49057354 -0.67499433 -0.67323764
H  1.25844789 -1.36107491 1.47361602
H  1.79923686 1.42361353 -1.40612182
H  1.79923686 -1.42361353 -1.40612182
C  -1.49057354 -0.67499433 -0.67323764
H  -1.25844789 -1.36107491 1.47361602
C  -1.49057354 0.67499433 -0.67323764
H  -1.25844789 1.36107491 1.47361602
H  -1.79923686 1.42361353 -1.40612182
H  -1.79923686 -1.42361353 -1.40612182
