program: Gaussian 16
title: Darko Cat1
version: ES64L-G16RevC.01
method: RB3LYP
basis: GenECP
operation: Freq
keyword: #N
keyword: Geom=AllCheck
keyword: Guess=TCheck
keyword: SCRF=Check
keyword: GenChk
keyword: RB3LYP/GenECP
keyword: Freq
converged: YES YES NO NO
title: Mulliken charges:
elementType: Rh Rh O O O O O O O O C C C C C H H H C H H H C H H H C C C C C H C H H H C O N H C C C H H H C H H H H H S C C C C H C H C H H O C H H H
charge: 0.315047 0.534597 -0.516750 -0.516931 -0.513660 -0.525397 -0.494802 -0.503030 -0.501937 -0.526359 0.674401 0.622514 0.675171 0.673581 -0.548177 0.206900 0.191398 0.192986 -0.549944 0.191276 0.193668 0.206463 -0.553289 0.214359 0.191455 0.184938 0.061061 0.012776 -0.182819 -0.180343 -0.148731 0.179199 -0.135491 0.168422 0.166000 0.166736 0.506384 -0.501511 -0.587372 0.371692 0.239197 -0.465589 -0.466431 0.157618 0.176967 0.157719 -0.497529 0.170775 0.164788 0.178445 0.252961 0.207080 0.277070 -0.112500 -0.126436 -0.169387 -0.201423 0.192289 -0.221793 0.175251 0.362058 0.161817 0.172846 -0.493782 -0.232113 0.171886 0.183130 0.170606
chargesum: -0.00000
title: Mulliken charges with hydrogens summed into heavy atoms:
elementType: Rh Rh O O O O O O O O C C C C C C C C C C C C C C O N C C C C S C C C C C C O C
charge: 0.315047 0.534597 -0.516750 -0.516931 -0.513660 -0.525397 -0.494802 -0.503030 -0.501937 -0.526359 0.674401 0.622514 0.675171 0.673581 0.043106 0.041463 0.037463 0.061061 0.012776 -0.003620 -0.011921 0.017268 0.031245 0.506384 -0.501511 -0.215681 0.239197 -0.005548 0.025873 0.016479 0.277070 -0.112500 0.065852 0.005865 -0.039607 -0.048946 0.362058 -0.493782 0.293509
1716.lowfreq: -5.8429 0.0009 0.0009 0.0012 6.0727 8.8258 10.4708 18.3174 21.8258
frequency: 10.0382 17.8084 21.5119 30.2869 44.8240 49.8515 55.1344 57.0167 67.1581 79.4762 80.6840 83.4373 84.5818 90.9371 92.4743 106.6259 109.3089 118.6835 126.6809 136.6407 145.4031 152.7675 155.2715 168.0107 173.3179 181.7642 194.6134 206.3758 213.6677 221.6501 226.5913 235.3079 239.9728 245.5725 249.5411 253.9739 262.0651 269.7026 279.5104 286.1453 291.6525 297.3033 309.5024 313.2625 316.8908 331.6049 343.0720 349.1841 357.0373 362.6536 368.2427 374.2541 378.3652 384.3381 414.5882 428.4369 440.4016 452.4734 468.0831 508.9126 518.0253 529.5213 539.1526 575.3976 577.1338 588.2707 594.1243 612.0161 621.1385 622.2434 632.6039 636.2597 647.0468 666.5532 698.6773 703.9360 712.9465 719.6088 724.0904 728.9859 730.1625 762.0555 776.3405 801.7314 810.0708 818.0010 826.3345 850.9168 865.2894 882.3488 901.0042 904.5580 938.3215 954.4711 954.6231 961.5401 967.3798 968.4752 971.5026 985.0947 999.4977 1004.5586 1023.7572 1054.7352 1055.4809 1057.9920 1058.2401 1058.6403 1064.6396 1070.9925 1073.9380 1075.1506 1108.1234 1112.8513 1152.1634 1167.1054 1177.6184 1185.7918 1192.1345 1194.2003 1202.2780 1215.6134 1221.9604 1256.5621 1296.1715 1298.4651 1303.2114 1328.8879 1344.1580 1348.0009 1348.8935 1353.0988 1395.9866 1398.2351 1401.7575 1426.3964 1436.9632 1447.5002 1450.1005 1453.2806 1455.7336 1458.8068 1470.2292 1472.2826 1479.3931 1488.9991 1493.3377 1494.5191 1496.6715 1498.3236 1500.4901 1502.2710 1514.9054 1515.3798 1515.9664 1519.6194 1522.5928 1534.5532 1547.6495 1554.5530 1557.4220 1562.1739 1591.2432 1618.6762 1624.8185 1643.1407 1652.0472 1656.2075 1733.4627 3037.9127 3056.4922 3061.9227 3064.5435 3064.7999 3066.7277 3104.1844 3106.2973 3125.9534 3128.5655 3137.2627 3137.4973 3137.6517 3138.1839 3161.2260 3163.4370 3171.6751 3172.1180 3173.4859 3186.4924 3195.9769 3203.8041 3205.2551 3210.2182 3214.4600 3223.5547 3231.5543 3238.9646 3599.8922
redmass: 1.0225 5.2483 4.9055 4.9448 5.5625 4.1063 3.0764 3.5284 6.1329 4.5301 4.2777 4.2430 1.2154 4.3301 6.9970 4.8407 2.0665 2.1848 3.7108 4.2637 4.0682 12.5654 5.2782 8.9244 6.1389 5.8257 3.6202 7.1250 8.4196 6.3301 3.7037 2.9107 3.1186 6.2608 2.6986 2.6014 6.4982 1.4332 5.4988 5.6941 4.9485 1.3312 3.8537 4.5694 5.3411 13.0787 4.7930 7.8920 5.1622 7.9706 3.8398 3.4949 5.4434 6.9274 3.7860 3.1424 1.9966 2.1502 2.9177 4.3084 6.1907 3.1009 2.9970 3.6930 4.7865 5.0404 5.2302 2.9394 3.0453 3.0609 7.5579 6.6088 6.8090 5.9331 7.7100 7.6379 4.7710 6.3375 6.4555 4.5505 5.9994 2.8852 3.8224 2.5491 3.4897 5.7577 1.2914 1.5912 4.6564 3.0089 2.3549 1.7982 2.4040 1.7078 3.0328 6.9354 1.4508 6.7803 1.4488 1.2993 1.7986 1.2926 3.6015 1.4727 1.3468 6.3180 1.4975 1.4961 2.4108 1.7405 1.7340 1.7335 3.3606 3.0593 1.3726 1.7201 1.7498 1.2696 1.7789 1.4149 2.1677 1.1928 1.3355 2.7526 1.6611 4.2256 1.4944 1.7805 1.4537 2.0923 7.5967 2.5303 1.4186 1.4433 1.4059 1.2260 5.2217 1.2376 3.1000 3.1196 2.9408 2.9515 1.1847 1.1440 1.1868 2.3733 1.1643 1.1225 1.1728 1.1895 1.2090 1.1245 1.0608 1.0704 1.0449 2.2835 1.0648 1.0670 2.1211 2.3975 4.5787 4.1594 6.9633 6.3924 6.1548 7.7903 5.4391 6.3791 8.8321 1.0336 1.0357 1.0369 1.0398 1.0398 1.0368 1.1079 1.0621 1.1035 1.1032 1.1030 1.0961 1.0959 1.1002 1.1012 1.1021 1.1064 1.1065 1.1054 1.1046 1.0870 1.0905 1.0901 1.0897 1.0936 1.0971 1.0943 1.0922 1.0787
irintensity: 0.6091 0.7262 0.1305 0.5013 1.8477 0.5084 4.9355 1.2661 4.4354 2.4740 0.6118 4.5446 0.0837 4.6087 1.0996 2.4502 8.4634 0.9533 6.7067 4.7285 2.4645 0.3543 1.8034 1.4156 0.0601 0.6111 0.8277 2.0269 0.9087 2.4217 4.0707 5.9739 1.5306 1.7219 0.4629 7.5266 0.6900 0.8928 1.4718 3.6860 0.5256 2.3179 0.8843 1.4335 13.6987 43.3293 5.4096 65.6241 9.2256 53.4047 4.9730 7.5231 73.0523 13.5600 0.3498 0.6735 71.6835 126.4541 2.5785 3.0770 45.4729 2.0406 29.0975 11.7894 0.3142 0.1025 3.6170 2.4285 2.7833 29.2604 6.5560 10.6497 7.2894 16.3460 170.0083 118.8390 28.5434 5.8169 11.7862 23.0394 13.5814 41.5055 19.7198 17.4520 7.8247 7.4656 15.5291 73.3249 32.3454 20.5961 1.3192 1.2295 0.9076 0.6236 0.4722 0.2976 2.0048 1.0007 5.5267 0.4866 3.0307 1.0637 2.4668 3.2700 2.4807 116.3567 0.5375 3.1524 7.4012 13.4103 26.3738 14.5089 7.2773 6.8682 15.5309 14.3619 17.7053 1.4764 8.3449 13.9845 41.7401 74.6160 54.4177 42.3374 71.5293 445.3685 48.1311 111.1973 29.1205 17.1620 9.9555 99.1995 89.1104 39.1023 85.5790 16.5438 841.9186 20.1872 400.3694 486.0621 5.6234 49.4818 9.1758 59.5147 120.0836 58.8760 37.9520 43.1153 58.1035 34.5265 70.3744 46.6003 10.4284 2.8733 8.5721 15.8273 47.6867 26.7909 173.8456 323.6459 5.2044 113.2218 0.6983 31.3338 143.3504 908.5076 147.9967 101.4298 313.7406 79.5618 15.6862 37.1128 2.4882 3.4596 3.6832 45.4910 12.5988 24.4106 50.8321 43.3720 10.6191 4.9367 4.8543 15.6690 29.6132 8.4274 8.7051 12.4366 2.6614 0.5059 6.6116 8.3190 5.0352 21.4302 22.2540 4.3408 10.7519 71.9274
temp: 298.150 k
press: 1.00000 atm
elementType: 45 45 8 8 8 8 8 8 8 8 6 6 6 6 6 1 1 1 6 1 1 1 6 1 1 1 6 6 6 6 6 1 6 1 1 1 6 8 7 1 6 6 6 1 1 1 6 1 1 1 1 1 16 6 6 6 6 1 6 1 6 1 1 8 6 1 1 1
symmnumber: 1
zpe: 1368547.7 jmol-1
zpe.correction: 0.521252 hartree
zpe.thermalcorrener: 0.562366 hartree
zpe.thermalcorrenthalpy: 0.563310 hartree
zpe.thermalcorrgfe: 0.445532 hartree
zpe.sumelectzpe: -2394.175758 hartree
zpe.sumelectthermal: -2394.134645 hartree
zpe.sumelectthermalent: -2394.133701 hartree
zpe.sumelectthermalfe: -2394.251479 hartree
dipole: -3.7931 6.6101 -4.4260
dipole: 8.8131
quadrupole: -198.6552 -240.9402 -249.2028
quadrupole: 8.1349 -3.4024 -2.0713
quadrupole: 30.9442 -11.3408 -19.6034 8.1349 -3.4024 -2.0713
hfenergy: -2394.6970105 hartree
pointgroup: C01 [X(C25H29N1O10Rh2S1)]
dipole: -1.5028982 2.588528 -1.7502239 debye
polarizability: 663.6405619|-17.1659278|535.7767632|0.0518497|-12.5245086|423.1734026 unknown
InChI: InChI=1/C19H20NO4S.3C2H3O2.2Rh/c1-19(2,12-25-14-10-8-13(24-3)9-11-14)20-17(21)15-6-4-5-7-16(15)18(22)23;3*1-2(3)4;;/h4-11,20H,12H2,1-3H3;3*1H3;;/q4*-2;2*+4/rC25H29NO10Rh2S/c1-16-29-37-30-17(2)34-38(37,33-16,35-18(3)31-37)36-24(32-37)22-10-8-7-9-21(22)23(27)26-25(4,5)15-39(38)20-13-11-19(28-6)12-14-20/h7-14,26H,15H2,1-6H3
charge 0 multiplicity 1
68 atoms
Rh -0.15437029 -0.60021186 -0.26847745
Rh 1.01360984 -2.58304951 0.53275768
O  0.96883307 -3.28026627 -1.41835893
O  -0.85395503 -3.41080138 0.87721987
O  1.01972263 -1.70698183 2.42164777
O  2.8236108 -1.57279407 0.19875136
O  -1.94106833 -1.58612481 0.07417841
O  -0.08551536 -1.41530066 -2.17484876
O  -0.1584574 0.08096012 1.6827385
O  1.68563771 0.235661 -0.56430011
C  0.48710567 -0.56419241 2.57512072
C  2.74417678 -0.36532435 -0.18383852
C  0.44149581 -2.56570909 -2.3302684
C  -1.90386581 -2.75775426 0.5718672
C  0.40541127 -3.15011666 -3.72157491
H  -0.47617923 -3.79791395 -3.80448447
H  0.32793827 -2.35961476 -4.47134187
H  1.29436299 -3.76010249 -3.90102936
C  -3.23097528 -3.44297831 0.78659037
H  -3.1683428 -4.15035469 1.61696366
H  -4.01422695 -2.70358129 0.97038517
H  -3.487643 -3.99986357 -0.12327322
C  0.64842185 0.12825809 3.90262397
H  1.3620776 0.94795461 3.75780009
H  -0.30426246 0.563883 4.21819347
H  1.02323833 -0.55831122 4.66405311
C  3.96779747 0.48479618 -0.21634885
C  3.83593626 1.87381115 -0.01473194
C  5.22021438 -0.07018397 -0.4947954
C  4.96470563 2.68933187 -0.12088687
C  6.34262072 0.75314134 -0.5985057
H  5.30187219 -1.14204363 -0.64673559
C  6.2127825 2.13230502 -0.41784336
H  4.86857548 3.75933666 0.04226851
H  7.31268414 0.32027143 -0.82520019
H  7.08360449 2.77678125 -0.50031805
C  2.52884026 2.47156731 0.47209106
O  2.19406863 2.33394293 1.65084364
N  1.83937935 3.19237546 -0.44628014
H  2.14878793 3.11291837 -1.40696321
C  0.53665951 3.84981314 -0.21773361
C  -0.54847429 2.8491071 0.25308712
C  0.68254328 4.90145332 0.90310695
H  -0.24736689 5.46997151 1.01190418
H  0.92280472 4.42623804 1.85650647
H  1.48830808 5.59844111 0.64793297
C  0.1510593 4.55263196 -1.52486974
H  -0.83612908 5.01461701 -1.42262872
H  0.87845637 5.33693113 -1.76210626
H  0.11185421 3.85231288 -2.36616372
H  -0.1856362 2.28258404 1.11026268
H  -1.43900568 3.41275929 0.54128115
S  -1.15196468 1.62083059 -1.01496205
C  -2.87512693 1.4814506 -0.54184607
C  -3.23831419 1.12609233 0.76861694
C  -3.86594782 1.67804459 -1.50547937
C  -4.57756915 0.99783462 1.10513386
H  -2.46991534 0.9352699 1.50993799
C  -5.21730923 1.5307748 -1.17665626
H  -3.59366687 1.95258472 -2.52073728
C  -5.57807077 1.19481594 0.13540722
H  -4.87612744 0.72712251 2.11353637
H  -5.96769893 1.68768264 -1.94249302
O  -6.85500531 1.03484967 0.5703761
C  -7.91933245 1.21209445 -0.36455912
H  -7.84969748 0.49468721 -1.19203456
H  -8.83925281 1.0303513 0.19487988
H  -7.93429479 2.23328181 -0.76612503
