program: Gaussian 09
title: 000077465
version: EM64L-G09RevD.01
frameworkgroup: C1[X(C11H22O2)]
method: RPBEPBE
basis: SDD
operation: Freq
keyword: #pfreq=noraman
keyword: PBEPBE/SDD
title: #p freq=noraman PBEPBE/SDD
converged: YES YES NO NO
title: Mulliken charges:
elementType: O O C C C C C C C C C C C H H H H H H H H H H H H H H H H H H H H H H
charge: -0.281059 -0.254786 0.032418 -0.435729 -0.419514 -0.347261 -0.363993 -0.353583 -0.354504 -0.696947 -0.697719 0.281760 -0.763572 0.227045 0.202678 0.207286 0.202705 0.223964 0.185922 0.212752 0.196481 0.195537 0.191628 0.196882 0.197457 0.201422 0.210872 0.215569 0.211053 0.212563 0.217483 0.209050 0.245772 0.246086 0.244280
chargesum: 0.00000
title: Mulliken charges with hydrogens summed into heavy atoms:
elementType: O O C C C C C C C C C C C
charge: -0.281059 -0.254786 0.259463 -0.025765 0.007155 0.051414 0.028025 0.034927 0.044375 -0.059454 -0.058623 0.281760 -0.027433
polarizability: 1.39467497e+02 -3.73664166e+00 1.34320236e+02 3.04215494e+00 1.00134116e+00 1.06525695e+02
1716.lowfreq: -4.4106 0.0004 0.0008 0.0009 3.7015 7.0827 24.5247 37.0973 44.6440
frequency: 24.3129 36.9975 44.5328 46.9093 55.6924 61.9879 69.8603 108.9206 115.2569 144.6603 155.3281 193.8640 216.8900 230.4314 239.8108 256.8458 291.3673 361.1669 388.3454 456.5219 483.4282 513.1752 572.4579 619.2152 722.8912 732.8576 754.6657 786.3746 826.2604 882.7562 892.4367 897.7502 909.5046 940.0030 983.7553 996.2905 1018.5640 1037.5883 1042.3293 1060.9455 1072.8785 1075.2839 1086.8352 1118.9154 1139.0640 1168.9913 1202.4631 1207.3080 1223.8185 1250.5688 1254.7837 1275.1582 1286.5835 1289.2402 1292.2896 1309.7876 1318.6083 1342.4024 1350.2877 1356.1837 1364.1962 1383.5364 1389.8658 1390.3697 1449.8069 1453.0397 1456.0931 1460.8964 1467.3231 1468.6309 1475.7031 1476.6006 1476.9307 1477.3413 1487.6276 1487.8736 1639.9208 2960.8364 2961.4016 2967.3950 2970.2119 2972.2227 2973.1645 2977.8511 2981.6345 3002.3519 3002.5250 3004.6960 3005.1543 3023.5810 3027.3287 3049.0303 3052.0738 3069.0889 3070.1790 3071.9818 3072.0681 3097.4219 3138.5385
redmass: 1.0473 3.2873 3.3399 3.3910 1.8143 1.6170 3.1744 2.8623 2.3929 2.3619 2.5575 3.0311 1.2388 1.1943 2.5205 3.0829 4.7014 2.8023 3.0655 3.0044 3.0509 2.9095 3.2480 4.6456 1.1934 1.0837 1.5388 1.2148 1.7463 2.5278 1.6540 1.7340 2.3554 1.4865 1.7617 1.8603 3.6509 3.0103 1.6735 1.4109 2.3830 2.4556 1.8903 2.1858 2.4915 2.1230 1.8418 2.4752 1.3910 1.2470 1.3232 1.2272 1.1570 1.0739 1.0914 1.2734 1.2887 1.3999 1.5373 1.5503 1.7202 1.2489 1.2162 1.2220 1.0804 1.0616 1.0530 1.0796 1.0680 1.0674 1.0441 1.0661 1.0647 1.0440 1.0837 1.0853 9.3814 1.0595 1.0585 1.0617 1.0598 1.0366 1.0362 1.0605 1.0602 1.0970 1.0894 1.0424 1.0873 1.1007 1.1011 1.1030 1.1033 1.1009 1.1006 1.0994 1.0993 1.0947 1.1021
irintensity: 0.6718 0.8214 0.3361 0.3063 0.0549 0.0700 2.7249 0.5056 0.3974 0.1706 0.9317 6.0660 0.3650 0.3346 0.3263 0.8039 4.6869 0.8182 3.4455 5.9502 1.3430 1.5912 4.3086 6.9641 4.7559 8.9621 8.5328 0.6771 2.5582 18.8386 5.1554 3.7876 26.8338 30.4075 26.5160 71.5791 4.8119 3.3723 9.1202 18.9057 2.7084 0.3351 2.6196 20.6658 7.2617 7.0274 103.6376 246.2715 2.7905 4.5129 6.3837 3.9321 0.3140 0.7538 0.2113 0.2506 0.4165 2.4969 4.7078 0.9247 2.0534 55.9112 10.6710 12.8035 3.7526 23.1950 16.9564 3.0877 0.1604 0.4152 11.8940 2.0239 5.4712 10.6558 18.1613 15.2466 180.4674 5.2299 1.6954 27.6970 40.9465 38.3923 39.3303 56.2192 40.2602 0.9488 3.2476 1.6597 23.7764 4.8677 5.2305 43.7423 43.9307 97.1346 88.7381 58.7595 54.0038 10.0156 10.3242
temp: 298.150 k
press: 1.00000 atm
elementType: 8 8 6 6 6 6 6 6 6 6 6 6 6 1 1 1 1 1 1 1 1 1 1 1 1 1 1 1 1 1 1 1 1 1 1
symmnumber: 1
zpe: 813765.1 jmol-1
zpe.correction: 0.309947 hartree
zpe.thermalcorrener: 0.327427 hartree
zpe.thermalcorrenthalpy: 0.328372 hartree
zpe.thermalcorrgfe: 0.261559 hartree
zpe.sumelectzpe: -581.749850 hartree
zpe.sumelectthermal: -581.732369 hartree
zpe.sumelectthermalent: -581.731425 hartree
zpe.sumelectthermalfe: -581.798237 hartree
dipole: -0.4190 -1.0820 -1.6364
dipole: 2.0060
quadrupole: -80.5225 -80.7325 -85.6462
quadrupole: -3.6244 -1.0928 -6.1404
quadrupole: 1.7779 1.5679 -3.3458 -3.6244 -1.0928 -6.1404
hfenergy: -582.0597966 hartree
pointgroup: C01 [X(C11H22O2)]
dipole: -0.242688 -0.4064369 -0.6315139 debye
polarizability: 137.7661928|-4.3280161|135.9729881|3.511578|-0.6703155|106.5742469 unknown
InChI: InChI=1S/C11H22O2/c1-4-6-8-11(9-7-5-2)13-10(3)12/h11H,4-9H2,1-3H3
charge 0 multiplicity 1
35 atoms
O  -0.353035 1.418301 -0.61472
O  0.691395 2.578173 1.124378
C  0.10013 0.100682 -0.030124
C  -0.962436 -0.921356 -0.456835
C  1.525508 -0.188462 -0.540933
C  -2.355474 -0.667552 0.159471
C  2.184218 -1.410311 0.141597
C  -3.406446 -1.710215 -0.284093
C  3.654758 -1.608059 -0.293847
C  -4.797482 -1.459931 0.337343
C  4.31901 -2.82838 0.378625
C  0.029727 2.579605 0.05938
C  -0.448199 3.808328 -0.686597
H  0.118649 0.224529 1.071162
H  -0.607997 -1.928453 -0.160209
H  -1.033179 -0.918994 -1.563091
H  1.496115 -0.337317 -1.638781
H  2.151159 0.703637 -0.345647
H  -2.276317 -0.67674 1.2669
H  -2.698779 0.346453 -0.124182
H  2.146995 -1.280116 1.243285
H  1.615392 -2.33403 -0.087204
H  -3.054832 -2.726013 -0.009081
H  -3.486497 -1.698037 -1.390414
H  3.696895 -1.721925 -1.39641
H  4.229909 -0.691234 -0.053075
H  -4.750436 -1.498473 1.442088
H  -5.532982 -2.2149 0.003759
H  -5.183598 -0.462712 0.053707
H  4.31454 -2.724717 1.480096
H  5.369395 -2.94648 0.054963
H  3.781229 -3.7623 0.127588
H  -1.437958 3.634591 -1.137798
H  0.258366 4.039427 -1.504796
H  -0.482045 4.668281 -0.001105
