program: Gaussian 09
title: 000077449
version: EM64L-G09RevD.01
frameworkgroup: C1[X(C10H14O4)]
method: RPBEPBE
basis: SDD
operation: Freq
keyword: #pfreq=noraman
keyword: PBEPBE/SDD
title: #p freq=noraman PBEPBE/SDD
converged: YES YES NO NO
title: Mulliken charges:
elementType: O O O O C C C C C C C C C C H H H H H H H H H H H H H H
charge: -0.295312 -0.287030 -0.282087 -0.440310 0.433489 0.052544 0.292620 0.269873 -0.597419 -0.533538 -0.432510 -0.521512 -0.532930 -0.498482 0.245168 0.291740 0.194022 0.233479 0.263439 0.202476 0.228988 0.227096 0.220518 0.243622 0.252484 0.203531 0.226551 0.339491
chargesum: 0.00000
title: Mulliken charges with hydrogens summed into heavy atoms:
elementType: O O O O C C C C C C C C C C
charge: -0.295312 -0.287030 -0.282087 -0.100819 0.433489 0.052544 0.292620 0.269873 -0.352251 -0.241798 -0.005009 0.173390 0.158306 0.184084
polarizability: 1.58660213e+02 2.73724522e+00 1.50495645e+02 2.89126407e+00 1.49936981e+00 7.41345228e+01
1716.lowfreq: -7.2593 -1.4889 -0.0006 -0.0003 0.0002 8.3172 37.7763 46.5998 74.4816
frequency: 37.6691 46.5523 74.4731 93.5343 105.1891 140.1371 155.7958 179.4552 188.7925 199.2100 217.1811 225.4262 264.4406 285.5689 307.1703 341.9155 352.4829 395.7270 420.3720 483.5275 499.2603 549.2504 579.4444 602.5443 676.8919 713.6202 747.5764 819.4851 865.5565 877.2851 906.7744 947.7722 962.1495 992.2447 1025.4133 1074.8407 1107.0941 1108.5548 1111.6842 1124.6587 1153.2716 1153.4630 1157.6169 1162.9352 1191.1821 1223.9408 1289.1916 1313.4967 1362.4932 1383.3405 1404.4550 1419.3645 1440.5360 1444.9496 1451.1127 1452.5002 1465.0503 1466.3576 1469.9015 1470.8102 1481.7876 1483.9770 1581.6319 1608.0055 2945.7169 2961.1910 2964.2008 2975.8385 3042.8095 3050.3032 3076.3700 3086.7326 3122.2645 3123.2466 3125.1877 3147.9650 3170.5638 3554.8956
redmass: 3.1328 3.4347 3.2304 3.4321 1.8741 3.7272 1.3961 1.8764 1.8551 2.1695 2.0844 3.4411 1.8832 2.9207 4.8023 1.3633 6.1309 3.5088 3.7024 5.7777 5.3419 5.1653 4.2019 4.5773 4.5794 3.9282 4.0591 1.6177 5.3479 1.5043 5.9194 8.6151 2.6146 2.7526 4.2888 4.9092 1.2532 1.2431 1.2580 2.5039 1.4005 1.4189 1.5668 1.1346 2.1706 1.5205 1.6861 2.9411 1.4358 4.8821 1.8418 1.2271 1.2222 1.4050 1.1253 1.1045 1.0759 1.2519 1.2181 1.0534 1.5764 1.1006 7.3742 6.6928 1.0686 1.0329 1.0362 1.0351 1.0933 1.1040 1.0951 1.0960 1.1045 1.0998 1.1056 1.0903 1.0917 1.0660
irintensity: 6.1540 2.0155 2.2506 9.1430 2.0992 4.5929 0.4667 4.3536 1.5119 0.6988 2.3583 0.7807 1.2462 4.6987 2.2526 181.6844 2.1083 30.0670 16.4719 2.4687 7.7819 13.0918 4.9510 8.3687 11.7940 0.9312 8.2862 39.4008 10.3735 30.3230 18.1320 56.0099 63.9175 25.4098 5.9265 235.1763 7.6709 9.4914 0.1160 24.5577 6.9354 2.6143 67.4616 11.9468 38.8537 46.3014 75.8728 62.3298 74.8302 7.9272 100.6411 5.4615 1.9622 51.7415 19.7458 1.9936 18.2660 51.6763 36.7837 24.6924 38.9691 9.3621 121.7461 25.2145 64.1218 77.4120 69.6176 79.7103 20.1371 45.6498 37.2402 47.3512 16.0198 22.3964 21.1726 8.1112 0.1424 6.2015
temp: 298.150 k
press: 1.00000 atm
elementType: 8 8 8 8 6 6 6 6 6 6 6 6 6 6 1 1 1 1 1 1 1 1 1 1 1 1 1 1
symmnumber: 1
zpe: 587279.0 jmol-1
zpe.correction: 0.223683 hartree
zpe.thermalcorrener: 0.239271 hartree
zpe.thermalcorrenthalpy: 0.240215 hartree
zpe.thermalcorrgfe: 0.180564 hartree
zpe.sumelectzpe: -689.205931 hartree
zpe.sumelectthermal: -689.190343 hartree
zpe.sumelectthermalent: -689.189399 hartree
zpe.sumelectthermalfe: -689.249050 hartree
dipole: -2.3705 3.3650 1.0856
dipole: 4.2569
quadrupole: -85.4330 -71.6488 -83.0572
quadrupole: 9.4253 -6.8249 -0.3655
quadrupole: -5.3867 8.3975 -3.0109 9.4253 -6.8249 -0.3655
hfenergy: -689.4296136 hartree
pointgroup: C01 [X(C10H14O4)]
dipole: 0.7003482 1.4248944 -0.5330253 debye
polarizability: 159.411408|-1.411503|149.5230121|-0.1301839|-5.1075593|74.355961 unknown
InChI: InChI=1S/C10H14O4/c1-12-8-4-7(6-11)5-9(13-2)10(8)14-3/h4-5,11H,6H2,1-3H3
charge 0 multiplicity 1
28 atoms
O  2.285914 0.125052 0.230171
O  0.757411 2.402732 -0.142478
O  0.93401 -2.491141 0.16935
O  -4.008144 -1.473901 0.354241
C  -1.929146 -0.228577 -0.271724
C  0.903373 0.016045 -0.02811
C  0.074544 1.172751 -0.172853
C  0.282022 -1.26568 -0.007652
C  -1.326609 1.054449 -0.294561
C  -1.127831 -1.374679 -0.122055
C  -3.440077 -0.35911 -0.417444
C  3.108044 0.768583 -0.816713
C  -0.049871 3.624127 -0.167409
C  2.3565 -2.658382 -0.174921
H  -1.955432 1.944853 -0.393881
H  -1.574279 -2.372834 -0.111675
H  -3.92716 0.602186 -0.144207
H  -3.72235 -0.595553 -1.459071
H  2.79899 1.816389 -0.962269
H  3.026982 0.211152 -1.771467
H  4.141609 0.72122 -0.440213
H  -0.747233 3.659498 0.691596
H  -0.619443 3.713809 -1.112911
H  0.674881 4.448175 -0.091656
H  3.005653 -2.130901 0.54046
H  2.562612 -2.294304 -1.200007
H  2.519715 -3.746694 -0.128436
H  -3.675585 -1.414268 1.286097
