program: Gaussian 09
title: 000077446
version: EM64L-G09RevD.01
frameworkgroup: C1[X(C14H11FO)]
method: RPBEPBE
basis: SDD
operation: Freq
keyword: #p
keyword: freq=noraman
keyword: PBEPBE/SDD
title: #p freq=noraman PBEPBE/SDD
converged: YES YES NO NO
title: Mulliken charges:
elementType: F O C C C C C C C C C C C C C C H H H H H H H H H H H
charge: -0.204422 -0.200348 -0.677503 0.347568 0.137022 0.294899 0.191267 -0.371739 -0.332504 -0.345659 -0.375185 -0.240399 -0.202074 -0.249650 -0.226334 -0.221298 0.242420 0.259805 0.234601 0.246924 0.278715 0.252575 0.228466 0.232804 0.231269 0.234511 0.234269
chargesum: 0.00000
title: Mulliken charges with hydrogens summed into heavy atoms:
elementType: F O C C C C C C C C C C C C C C
charge: -0.204422 -0.200348 -0.175277 0.347568 0.137022 0.294899 0.191267 -0.137138 -0.085580 -0.066944 -0.122610 -0.011932 0.030730 -0.018382 0.008177 0.012971
polarizability: 2.21386467e+02 -1.56465105e+00 1.14998984e+02 1.70500328e+01 -8.57602997e+00 1.08826139e+02
1716.lowfreq: -2.6496 -0.0011 -0.0002 -0.0002 4.6025 10.0406 24.4205 25.6850 60.1378
frequency: 24.3255 25.0218 60.1086 62.5310 147.9473 150.1007 180.8168 269.4458 281.6068 305.5261 399.2067 404.7059 417.6041 448.2088 453.2226 516.5804 529.5534 573.0032 577.5582 613.6569 651.7815 696.0990 713.1028 744.8430 760.3516 767.7052 798.0703 839.8442 858.1410 868.9310 917.2271 941.2965 956.5066 979.1298 979.8295 989.5930 991.1109 1011.4751 1027.5450 1032.0903 1085.3418 1087.7624 1163.8093 1169.1899 1173.6019 1178.1096 1188.6115 1213.1510 1229.4144 1281.4043 1302.0529 1319.2042 1387.6751 1389.3064 1435.8210 1436.4292 1447.5507 1479.6520 1484.0946 1576.4075 1593.1875 1601.5439 1615.1413 1628.7197 2988.6232 3044.5865 3128.6146 3128.9792 3138.5510 3143.9554 3149.8764 3159.2245 3162.5436 3169.7335 3178.5792
redmass: 5.0282 6.6718 5.1606 5.1577 5.1338 5.6048 5.6944 3.7708 3.8796 6.2619 2.8097 3.1042 5.0018 3.5313 5.3308 6.1998 4.0695 3.0216 6.2281 6.4360 5.6028 1.8158 4.1193 5.0107 1.3594 1.7465 3.6118 2.8074 1.2536 1.9427 1.8041 1.3938 1.7211 3.9506 1.4101 6.2454 1.3803 1.3453 2.0408 2.0525 1.7923 2.0332 1.1104 2.0584 1.0731 1.1685 1.1317 2.2242 2.6362 1.4543 1.9191 1.3370 9.3594 8.2122 1.6441 2.2489 1.4771 2.2056 2.7183 6.5544 6.5703 6.7125 7.0333 7.9490 1.0599 1.0992 1.0876 1.0850 1.0880 1.0897 1.0925 1.0960 1.0953 1.1013 1.0991
irintensity: 0.5396 1.1758 1.2511 1.7421 0.1150 1.3121 0.5456 5.2537 3.0613 5.6399 0.1322 1.9956 2.0666 4.4163 4.4269 9.8798 1.0513 10.7889 10.2639 0.6954 8.2068 49.6458 1.9380 3.1417 89.4624 58.5046 10.5153 14.9190 0.3948 4.1754 3.4689 3.8774 0.7661 57.9078 4.9314 2.6087 0.5259 0.3570 1.3516 10.2929 12.5221 21.0037 1.2808 17.3995 5.8916 7.5672 30.1491 138.2800 11.5572 43.4805 74.6226 17.2479 2.6600 0.0425 17.0113 23.0497 15.5072 6.8866 47.9357 64.9507 12.0603 47.7398 18.9391 1.4121 28.6767 3.1172 5.4923 0.3229 6.7649 11.2335 20.0902 19.4161 20.9319 22.7033 9.2078
temp: 298.150 k
press: 1.00000 atm
elementType: 9 8 6 6 6 6 6 6 6 6 6 6 6 6 6 6 1 1 1 1 1 1 1 1 1 1 1
symmnumber: 1
zpe: 543259.2 jmol-1
zpe.correction: 0.206917 hartree
zpe.thermalcorrener: 0.220267 hartree
zpe.thermalcorrenthalpy: 0.221211 hartree
zpe.thermalcorrgfe: 0.164587 hartree
zpe.sumelectzpe: -714.042772 hartree
zpe.sumelectthermal: -714.029421 hartree
zpe.sumelectthermalent: -714.028477 hartree
zpe.sumelectthermalfe: -714.085102 hartree
dipole: -1.3703 2.6292 -1.3344
dipole: 3.2513
quadrupole: -68.3065 -90.8118 -94.2673
quadrupole: 1.0008 2.9662 -1.8392
quadrupole: 16.1554 -6.3499 -9.8054 1.0008 2.9662 -1.8392
hfenergy: -714.2496886 hartree
pointgroup: C01 [X(C14H11F1O1)]
dipole: -0.5343194 -0.0678825 1.1602414 debye
polarizability: 220.8366533|-15.6419865|103.352908|-10.525699|1.6364854|121.0220293 unknown
InChI: InChI=1S/C14H11FO/c15-13-9-5-4-8-12(13)10-14(16)11-6-2-1-3-7-11/h1-9H,10H2
charge 0 multiplicity 1
27 atoms
F  1.783521 1.93194 -0.891596
O  -0.138982 -0.882197 -1.309041
C  0.368619 0.17506 0.843759
C  1.831257 -0.030605 0.521969
C  -0.582947 -0.321024 -0.269796
C  -2.061007 -0.121446 -0.069916
C  2.509917 0.843433 -0.352449
C  2.586129 -1.105309 1.050995
C  -2.60606 0.48888 1.092361
C  -2.941191 -0.56705 -1.094276
C  3.858789 0.70544 -0.710221
C  3.948168 -1.282283 0.71629
C  4.584996 -0.377735 -0.164453
C  -4.001952 0.64825 1.226385
C  -4.333876 -0.406625 -0.960375
C  -4.868449 0.201747 0.201553
H  0.10625 -0.353472 1.780655
H  0.155855 1.248007 1.014129
H  2.094585 -1.813252 1.728706
H  -1.950667 0.842721 1.894891
H  -2.502066 -1.033528 -1.982445
H  4.317511 1.423568 -1.396011
H  4.508641 -2.122639 1.13874
H  5.639181 -0.511265 -0.428733
H  -4.414486 1.120001 2.124842
H  -5.003938 -0.751583 -1.755313
H  -5.951895 0.327566 0.30675
